{"text_format":"1","workbook":"xlsx","n_sheets":12,"sheets":["BrewReport","Labels","Data","Omregninger","Malt","Tilsætninger","Gær","Humle","Typer","Malt X-ref.","Indkøb","Links"],"not_rendered":{"charts":0,"images":6,"macros":1,"external_links":0,"defined_names":5,"comments":5,"pivot_tables":0},"unopened":[],"bounds":{"document_bytes":16777216,"sheet_cells":100000,"rows_first":2000,"rows_last":500,"rows_between":2000,"halvings":0,"cell_chars":16384,"cell_head_chars":4096},"cells_cut":0,"cells_raw":0,"read":"whole","date_system":"1900"}

{"sheet":"BrewReport","index":0,"n_rows":78,"n_cols":12,"rows_kept":78,"cut":false,"hidden":false,"merged":[[48,6,48,7],[48,8,48,11],[51,6,51,7],[1,2,1,11],[0,0,0,1],[0,2,0,11],[71,6,71,8],[71,9,71,11],[72,6,72,8],[72,9,72,11],[39,6,39,7],[66,8,66,9],[57,8,57,9],[5,8,5,9],[3,8,3,9],[7,10,7,11],[31,8,31,9],[30,8,30,9],[29,8,29,9],[3,5,3,6],[21,6,21,7],[22,6,22,7],[23,6,23,7],[24,6,24,7],[25,6,25,7],[47,6,47,11],[37,8,37,9],[25,8,25,9],[26,8,26,9],[38,6,38,7],[32,6,32,7],[33,6,33,7],[43,6,43,9],[37,6,37,7],[34,6,34,7],[26,6,26,7],[27,8,27,9],[29,6,29,7],[30,6,30,7],[31,6,31,7],[45,10,45,11],[2,2,2,3],[5,5,5,6],[7,8,7,9],[33,8,33,9],[11,6,11,7],[10,6,10,7],[9,6,9,7],[8,6,8,7],[6,6,6,11],[16,6,16,7],[15,6,15,7],[23,8,23,9],[22,8,22,9],[2,9,2,11],[20,8,20,9],[21,8,21,9],[32,8,32,9],[2,5,2,6],[7,6,7,7],[18,6,18,7],[14,6,14,7],[13,6,13,7],[12,6,12,7],[24,8,24,9],[68,8,68,9],[28,8,28,9],[57,6,57,7],[68,6,68,7],[67,8,67,9],[49,6,49,7],[52,8,52,9],[50,8,50,9],[50,10,50,11],[58,8,58,9],[53,6,53,7],[52,6,52,7],[62,6,62,11],[57,10,57,11],[65,10,65,11],[65,8,65,9],[56,7,56,11],[59,8,59,9],[49,8,49,11],[67,6,67,7],[66,6,66,7],[65,6,65,7],[64,6,64,7],[63,6,63,7],[66,10,66,11],[36,6,36,7],[39,8,39,9],[38,8,38,9],[56,1,56,4],[55,0,55,4],[27,6,27,7],[76,9,76,11],[77,6,77,8],[77,9,77,11],[75,6,75,8],[75,9,75,11],[74,6,74,8],[74,9,74,11],[73,6,73,8],[73,9,73,11],[76,6,76,8],[67,10,68,11],[69,6,69,7],[69,8,69,9],[69,10,69,11],[64,10,64,11],[64,8,64,9],[63,8,63,11],[60,6,60,7],[45,6,45,7],[28,6,28,7],[40,6,40,7],[55,6,55,11],[53,8,53,9],[51,8,51,9],[44,6,44,7],[58,10,59,11],[59,6,59,7],[58,6,58,7],[60,8,60,9],[60,10,60,11],[35,6,35,7],[35,8,35,9],[51,10,52,11],[42,6,42,11],[44,10,44,11],[44,8,44,9],[45,8,45,9],[53,10,53,11],[34,8,34,9],[36,8,36,9],[40,8,40,9],[5,0,5,1],[3,0,3,1],[2,0,2,1],[1,0,1,1],[53,0,53,1],[52,0,52,1],[51,0,51,1],[50,0,50,1],[49,0,49,1],[48,0,48,1],[47,0,47,1],[46,0,46,1],[45,0,45,1],[44,0,44,1],[39,0,39,1],[38,0,38,1],[37,0,37,1],[36,0,36,1],[35,0,35,1],[17,0,17,1],[16,0,16,1],[15,0,15,1],[14,0,14,1],[6,0,6,2],[40,0,40,1],[8,0,8,1],[13,0,13,1],[12,0,12,1],[11,0,11,1],[10,0,10,1],[9,0,9,1],[66,0,69,4],[76,1,76,2],[75,1,75,2],[74,1,74,2],[73,1,73,2],[72,1,72,2],[71,1,71,2],[71,3,71,5],[76,3,76,5],[75,3,75,5],[42,0,42,4],[73,3,73,5],[74,3,74,5],[72,3,72,5],[65,1,65,4]]}
["Bryggeri:",null,{"$f":"IF(Data!B2=\"\",\"\",Data!B2)","v":"eyeT Brewery"}]
["Bryg navn:"]
["Bryg nr.:",null,73,null,"Type:","Cream Ale",null,null,"Dato:"]
["Typiske data:",null,"EBC",{"$f":"IF($F$3=\"\",\"\",CONCATENATE(VLOOKUP($F$3,Typer!$C$4:$N$102,8,FALSE),\" - \",VLOOKUP($F$3,Typer!$C$4:$N$102,9,FALSE)))","v":"10 - 5"},"OG",{"$f":"IF($F$3=\"\",\"\",CONCATENATE(VLOOKUP($F$3,Typer!$C$4:$N$102,2,FALSE),\" - \",VLOOKUP($F$3,Typer!$C$4:$N$102,3,FALSE)))","v":"1055 - 1042"},null,"IBU",{"$f":"IF($F$3=\"\",\"\",CONCATENATE(VLOOKUP($F$3,Typer!$C$4:$N$102,10,FALSE),\" - \",VLOOKUP($F$3,Typer!$C$4:$N$102,11,FALSE)))","v":"20 - 15"},null,"RBR",{"$f":"IF($F$3=\"\",\"\",VLOOKUP($F$3,Typer!$C$4:$N$102,12,FALSE))","v":0.38}]
[]
["Dette brygs data:",null,null,{"$f":"IF(Data!D26=0,\"\",Data!D26)","v":10},"OG",{"$f":"IF(C19=0,\"\",IF(C50=\"\",IF(J3=\"\",Data!F26,C49),IF(J3=\"\",Data!F26,C50)))","v":1055},null,"IBU",{"$f":"IF(Data!F54=0,\"\",Data!F54)","v":23.730840000000001},null,"RBR",{"$f":"IF(I50=\"\",\"\",IF(C52=\"\",IF(I6=\"\",\"\",(Data!F54/(F6-1000)*(1+((Data!E30/100)-0.7655)))),(Data!F54/(F6-1000)*(1+((C53/100)-0.7655)))))","v":0.44204082872727279}]
["Ingredienser",null,null,"fra:","Hjemmebryggeren",null,"Mæskning"]
["Malttype",null,"Mængde","Enhed","Priser",null,"Proces",null,"Tid",null,"Temperatur"]
["Pale Ale",null,5.5,"kg",{"$f":"IFERROR(VLOOKUP($A9,Malt!$A$3:$K$75,COLUMN(INDIRECT(CONCATENATE(HLOOKUP($E$7,Malt!$G$1:$K$2,2,FALSE),2))),FALSE),\"\")","v":104.5}]
[null,null,null,"kg",{"$f":"IFERROR(VLOOKUP($A10,Malt!$A$3:$K$75,COLUMN(INDIRECT(CONCATENATE(HLOOKUP($E$7,Malt!$G$1:$K$2,2,FALSE),2))),FALSE),\"\")","v":""},null,"Indmæskning",null,20,"min",{"$f":"CONCATENATE(\"35 - \",K11)","v":"35 - 65"},"°C"]
{"$rows_left_out":69}
{"sheet":"Labels","index":1,"n_rows":84,"n_cols":22,"rows_kept":84,"cut":false,"hidden":false,"merged":[[0,1,0,23],[1,3,1,9],[5,3,6,9],[5,10,9,11],[5,15,6,21],[5,22,9,23],[8,4,8,5],[8,16,8,17],[2,13,4,23],[2,1,4,11],[19,3,19,9],[14,4,14,8],[16,4,16,8],[26,3,27,9],[26,15,27,21],[10,22,20,23],[10,4,10,8],[10,10,20,11],[10,16,10,20],[14,16,14,20],[16,16,16,20],[11,4,11,5],[11,16,11,17],[12,16,12,20],[12,4,12,8],[19,15,19,21],[23,13,25,23],[26,22,30,23],[29,16,29,17],[20,4,20,5],[29,4,29,5],[20,6,20,9],[20,18,20,21],[31,22,41,23],[33,16,33,20],[26,10,30,11],[23,1,25,11],[47,10,51,11],[40,3,40,9],[40,15,40,21],[56,16,56,20],[61,3,61,9],[50,4,50,5],[43,4,43,9],[43,15,43,18],[44,1,46,11],[44,13,46,23],[32,4,32,5],[31,4,31,8],[31,16,31,20],[35,4,35,8],[37,4,37,8],[35,16,35,20],[37,16,37,20],[33,4,33,8],[31,10,41,11],[32,16,32,17],[56,4,56,8],[68,22,72,23],[65,13,67,23],[82,15,82,21],[68,3,69,9],[61,15,61,21],[58,4,58,8],[58,16,58,20],[68,15,69,21],[71,16,71,17],[77,4,77,8],[79,4,79,8],[73,4,73,8],[73,16,73,20],[74,4,74,5],[74,16,74,17],[75,4,75,8],[75,16,75,20],[73,10,83,11],[82,3,82,9],[41,6,41,9],[41,18,41,21],[62,6,62,9],[62,18,62,21],[83,6,83,9],[83,18,83,21],[73,22,83,23],[47,22,51,23],[50,16,50,17],[52,22,62,23],[65,1,67,11],[68,10,72,11],[71,4,71,5],[77,16,77,20],[79,16,79,20],[47,3,48,9],[47,15,48,21],[52,4,52,8],[52,16,52,20],[52,10,62,11],[53,4,53,5],[53,16,53,17],[54,4,54,8],[54,16,54,20]]}
[null,"FLASKE-ETIKETTER"]
[null,null,null,"Udfyldes automatisk fra BrewReport til denne Label "]
[null,{"$f":"IF(BrewReport!C1=\"\",\"\",BrewReport!C1)","v":"eyeT Brewery"},null,null,null,null,null,null,null,null,null,null,null,{"$f":"$B$3","v":"eyeT Brewery"}]
[]
[]
[null,null,null,{"$f":"IF(BrewReport!C2<>\"\",CONCATENATE(BrewReport!C2,\" - \",BrewReport!F3),IF(BrewReport!F3=\"\",\"\",BrewReport!F3))","v":"Cream Ale"},null,null,null,null,null,null,null,null,null,null,null,{"$f":"$D$6","v":"Cream Ale"}]
[]
[]
[null,null,null,"Brygget:",{"$f":"IF(BrewReport!J3=\"\",\"\",BrewReport!J3)","v":""},null,"Tappet:",{"$f":"IF(BrewReport!C51=\"\",\"\",BrewReport!C51)","v":""},"Bryg #",{"$f":"IF(BrewReport!C3=\"\",\"\",BrewReport!C3)","v":73},null,null,null,null,null,"Brygget:",{"$f":"$E$9","v":""},null,"Tappet:",{"$f":"$H$9","v":""},{"$f":"$I$9","v":"Bryg #"},{"$f":"$J$9","v":73}]
[]
{"$rows_left_out":75}
{"sheet":"Data","index":2,"n_rows":333,"n_cols":13,"rows_kept":333,"cut":false,"hidden":false,"merged":[[0,0,0,5],[33,4,33,5],[32,4,32,5],[53,2,53,4],[1,1,1,5],[2,1,2,5],[5,2,5,5],[4,2,4,5],[3,2,3,5],[15,8,15,10],[20,8,20,10],[19,8,19,10],[18,8,18,10],[26,2,26,3],[17,8,17,10],[16,8,16,10],[21,8,21,10],[22,8,22,10],[55,1,55,5],[29,0,29,1],[31,7,32,7],[30,7,30,10],[23,8,23,10],[31,10,32,10],[31,9,32,9],[31,8,32,8],[28,8,28,10],[29,2,29,3],[27,8,27,10],[26,8,26,10],[25,8,25,10],[24,8,24,10]]}
["STAMDATA"]
["Bryggeri","eyeT Brewery"]
["Brygmester","André"]
["Mæskeeffektivitet",0.75,"Anvendes til at estimere Original Gravity"]
["Urtmængde i liter",25,"Anvendes til at beregne Effektivitet og Original Gravity"]
["Flaskestørrelse i liter",0.5,"Anvendes til at beregne og vise antal genstande"]
[]
["Beregninger","Malt","%","EBC","Ekstraktudbytte","OG"]
[null,{"$f":"IF(BrewReport!A9=\"\",\"\",BrewReport!A9)","v":"Pale Ale"},{"$f":"IF(B9=\"\",\"\",ROUND(((BrewReport!C9/BrewReport!$C$19)*100),1))","v":100},{"$f":"IF(B9=\"\",\"\",IF(BrewReport!C9=\"\",\"\",ROUND((VLOOKUP(B9,Malt!$A$3:$D$75,3,)*(Data!C9/100)),1)))","v":8},{"$f":"IF(B9=\"\",\"\",(VLOOKUP(B9,Malt!$A$2:$D$75,4,)*C9/100))","v":300},"|"]
[null,{"$f":"IF(BrewReport!A10=\"\",\"\",BrewReport!A10)","v":""},{"$f":"IF(B10=\"\",\"\",ROUND(((BrewReport!C10/BrewReport!$C$19)*100),1))","v":""},{"$f":"IF(B10=\"\",\"\",IF(BrewReport!C10=\"\",\"\",ROUND((VLOOKUP(B10,Malt!$A$3:$D$75,3,)*(Data!C10/100)),1)))","v":""},{"$f":"IF(B10=\"\",\"\",(VLOOKUP(B10,Malt!$A$2:$D$75,4,)*C10/100))","v":""},"|"]
{"$rows_left_out":324}
{"sheet":"Omregninger","index":3,"n_rows":167,"n_cols":6,"rows_kept":167,"cut":false,"hidden":false,"merged":[[24,1,24,2],[11,1,11,4],[22,1,22,3],[12,1,12,6]]}
[]
["Farver:"]
[]
[null,"Formål","Formel","Indtast","Beregn","Resultat"]
[null,"EBC to SRM:","SRM = EBC × 0,508","Indtast EBC",null,{"$f":"IF(E5=\"\",\"\",ROUND((E5*0.508),0))","v":""}]
[null,"SRM to EBC:","EBC = SRM × 1,97","Indtast SRM",null,{"$f":"IF(E6=\"\",\"\",ROUND((E6*1.97),0))","v":""}]
[null,"Lovibond to SRM:","SRM = (1,3546 × °L) - 0,76","Indtast °L",null,{"$f":"IF(E7=\"\",\"\",ROUND(((1.3546*E7)-0.76),0))","v":""}]
[null,"SRM to Lovibond:","°L = (SRM + 0,76) ÷ 1,3546","Indtast SRM",null,{"$f":"IF(E8=\"\",\"\",ROUND(((E8+0.76)/1.3546),0))","v":""}]
[]
["Refraktometer:"]
{"$rows_left_out":158}
{"sheet":"Malt","index":4,"n_rows":82,"n_cols":16,"rows_kept":82,"cut":false,"hidden":false,"merged":[[77,1,77,2]]}
["Malttyper","EBC Range","EBC Avg.","Ekstraktudbytte","Karakteristik","Malt i kg","Brygladen","Hjemmebryggeren","Albryg (10g interval)","Bryglageret","Brygforretningen",null,"Malt Pris\nGrupper","Priser\nkr./kg",null,"DropDown Menu"]
["Basis Malt",null,null,null,null,null,"G","H","I","J","K",null,null,15]
["Pilsner","2,5 - 3,5",3,"300","Høj enzymaktivitet",{"$f":"IFERROR(VLOOKUP(Malt!$A3,BrewReport!$A$9:$C$18,3,FALSE),0)","v":0},{"$f":"F3*N5","v":0},{"$f":"F3*N7","v":0},{"$f":"F3*N7","v":0},{"$f":"F3*N7","v":0},{"$f":"F3*N5","v":0},null,null,16,null,{"$f":"IFERROR(INDEX($A$3:$A$75, SMALL(IF(ISBLANK(INDIRECT(CONCATENATE(\"$\",HLOOKUP(BrewReport!$E$7,$G$1:$K$2,2,FALSE),\"$3:$\",HLOOKUP(BrewReport!$E$7,$G$1:$K$2,2,FALSE),\"$80\"))), \"\", ROW(INDIRECT(CONCATENATE(\"$\",HLOOKUP(BrewReport!$E$7,$G$1:$K$2,2,FALSE),\"$3:$\",HLOOKUP(BrewReport!$E$7,$G$1:$K$2,2,FALSE),\"$80\")))-MIN(ROW(INDIRECT(CONCATENATE(\"$\",HLOOKUP(BrewReport!$E$7,$G$1:$K$2,2,FALSE),\"$3:$\",HLOOKUP(BrewReport!$E$7,$G$1:$K$2,2,FALSE),\"$80\"))))+1), ROW(A1))),\"\")","v":"Pilsner"}]
["Fuglsang Pilsner","3,7","3,7","320","Dansk, Høj enzymaktivitet",{"$f":"IFERROR(VLOOKUP(Malt!$A4,BrewReport!$A$9:$C$18,3,FALSE),0)","v":0},null,null,{"$f":"F4*N2","v":0},null,null,null,null,17,null,{"$f":"IFERROR(INDEX($A$3:$A$75, SMALL(IF(ISBLANK(INDIRECT(CONCATENATE(\"$\",HLOOKUP(BrewReport!$E$7,$G$1:$K$2,2,FALSE),\"$3:$\",HLOOKUP(BrewReport!$E$7,$G$1:$K$2,2,FALSE),\"$80\"))), \"\", ROW(INDIRECT(CONCATENATE(\"$\",HLOOKUP(BrewReport!$E$7,$G$1:$K$2,2,FALSE),\"$3:$\",HLOOKUP(BrewReport!$E$7,$G$1:$K$2,2,FALSE),\"$80\")))-MIN(ROW(INDIRECT(CONCATENATE(\"$\",HLOOKUP(BrewReport!$E$7,$G$1:$K$2,2,FALSE),\"$3:$\",HLOOKUP(BrewReport!$E$7,$G$1:$K$2,2,FALSE),\"$80\"))))+1), ROW(A2))),\"\")","v":"Vienna"}]
["Pilsner Bohemian","2,5 - 3,5",3,"300","Høj enzymaktivitet",{"$f":"IFERROR(VLOOKUP(Malt!$A5,BrewReport!$A$9:$C$18,3,FALSE),0)","v":0},{"$f":"F5*N5","v":0},null,{"$f":"F5*N3","v":0},{"$f":"F5*N7","v":0},null,null,"Grp 1 ",18,null,{"$f":"IFERROR(INDEX($A$3:$A$75, SMALL(IF(ISBLANK(INDIRECT(CONCATENATE(\"$\",HLOOKUP(BrewReport!$E$7,$G$1:$K$2,2,FALSE),\"$3:$\",HLOOKUP(BrewReport!$E$7,$G$1:$K$2,2,FALSE),\"$80\"))), \"\", ROW(INDIRECT(CONCATENATE(\"$\",HLOOKUP(BrewReport!$E$7,$G$1:$K$2,2,FALSE),\"$3:$\",HLOOKUP(BrewReport!$E$7,$G$1:$K$2,2,FALSE),\"$80\")))-MIN(ROW(INDIRECT(CONCATENATE(\"$\",HLOOKUP(BrewReport!$E$7,$G$1:$K$2,2,FALSE),\"$3:$\",HLOOKUP(BrewReport!$E$7,$G$1:$K$2,2,FALSE),\"$80\"))))+1), ROW(A3))),\"\")","v":"Pale Ale"}]
["Vienna","5 - 7","6","300","Farve, sødme og fylde",{"$f":"IFERROR(VLOOKUP(Malt!$A6,BrewReport!$A$9:$C$18,3,FALSE),0)","v":0},{"$f":"F6*N5","v":0},{"$f":"F6*N7","v":0},{"$f":"F6*N3","v":0},null,{"$f":"F6*N5","v":0},null,"Grp 2",19,null,{"$f":"IFERROR(INDEX($A$3:$A$75, SMALL(IF(ISBLANK(INDIRECT(CONCATENATE(\"$\",HLOOKUP(BrewReport!$E$7,$G$1:$K$2,2,FALSE),\"$3:$\",HLOOKUP(BrewReport!$E$7,$G$1:$K$2,2,FALSE),\"$80\"))), \"\", ROW(INDIRECT(CONCATENATE(\"$\",HLOOKUP(BrewReport!$E$7,$G$1:$K$2,2,FALSE),\"$3:$\",HLOOKUP(BrewReport!$E$7,$G$1:$K$2,2,FALSE),\"$80\")))-MIN(ROW(INDIRECT(CONCATENATE(\"$\",HLOOKUP(BrewReport!$E$7,$G$1:$K$2,2,FALSE),\"$3:$\",HLOOKUP(BrewReport!$E$7,$G$1:$K$2,2,FALSE),\"$80\"))))+1), ROW(A4))),\"\")","v":"Munich (Type 2)"}]
["Pale Ale","7,0 - 9,0",8,"300","Mørkere og mere maltet end Pilsner",{"$f":"IFERROR(VLOOKUP(Malt!$A7,BrewReport!$A$9:$C$18,3,FALSE),0)","v":5.5},{"$f":"F7*N7","v":110},{"$f":"F7*N6","v":104.5},{"$f":"F7*N3","v":88},{"$f":"F7*N6","v":104.5},{"$f":"F7*N5","v":99},null,"Grp 3",20,null,{"$f":"IFERROR(INDEX($A$3:$A$75, SMALL(IF(ISBLANK(INDIRECT(CONCATENATE(\"$\",HLOOKUP(BrewReport!$E$7,$G$1:$K$2,2,FALSE),\"$3:$\",HLOOKUP(BrewReport!$E$7,$G$1:$K$2,2,FALSE),\"$80\"))), \"\", ROW(INDIRECT(CONCATENATE(\"$\",HLOOKUP(BrewReport!$E$7,$G$1:$K$2,2,FALSE),\"$3:$\",HLOOKUP(BrewReport!$E$7,$G$1:$K$2,2,FALSE),\"$80\")))-MIN(ROW(INDIRECT(CONCATENATE(\"$\",HLOOKUP(BrewReport!$E$7,$G$1:$K$2,2,FALSE),\"$3:$\",HLOOKUP(BrewReport!$E$7,$G$1:$K$2,2,FALSE),\"$80\"))))+1), ROW(A5))),\"\")","v":"Munich Light (Type 1)"}]
["Munich (Type 2)","20 - 25","25","290","Sødme og fylde",{"$f":"IFERROR(VLOOKUP(Malt!$A8,BrewReport!$A$9:$C$18,3,FALSE),0)","v":0},{"$f":"F8*N5","v":0},{"$f":"F8*N7","v":0},{"$f":"F8*N7","v":0},{"$f":"F8*N16","v":0},{"$f":"F8*N5","v":0},null,"Grp 4",21,null,{"$f":"IFERROR(INDEX($A$3:$A$75, SMALL(IF(ISBLANK(INDIRECT(CONCATENATE(\"$\",HLOOKUP(BrewReport!$E$7,$G$1:$K$2,2,FALSE),\"$3:$\",HLOOKUP(BrewReport!$E$7,$G$1:$K$2,2,FALSE),\"$80\"))), \"\", ROW(INDIRECT(CONCATENATE(\"$\",HLOOKUP(BrewReport!$E$7,$G$1:$K$2,2,FALSE),\"$3:$\",HLOOKUP(BrewReport!$E$7,$G$1:$K$2,2,FALSE),\"$80\")))-MIN(ROW(INDIRECT(CONCATENATE(\"$\",HLOOKUP(BrewReport!$E$7,$G$1:$K$2,2,FALSE),\"$3:$\",HLOOKUP(BrewReport!$E$7,$G$1:$K$2,2,FALSE),\"$80\"))))+1), ROW(A6))),\"\")","v":"Maris Otter Ale"}]
["Munich Light (Type 1)","13 - 17","15","290","Sødme og fylde",{"$f":"IFERROR(VLOOKUP(Malt!$A9,BrewReport!$A$9:$C$18,3,FALSE),0)","v":0},{"$f":"F9*N5","v":0},{"$f":"F9*N7","v":0},{"$f":"F9*N7","v":0},{"$f":"F9*N16","v":0},{"$f":"F9*N5","v":0},null,"Grp 5",22,null,{"$f":"IFERROR(INDEX($A$3:$A$75, SMALL(IF(ISBLANK(INDIRECT(CONCATENATE(\"$\",HLOOKUP(BrewReport!$E$7,$G$1:$K$2,2,FALSE),\"$3:$\",HLOOKUP(BrewReport!$E$7,$G$1:$K$2,2,FALSE),\"$80\"))), \"\", ROW(INDIRECT(CONCATENATE(\"$\",HLOOKUP(BrewReport!$E$7,$G$1:$K$2,2,FALSE),\"$3:$\",HLOOKUP(BrewReport!$E$7,$G$1:$K$2,2,FALSE),\"$80\")))-MIN(ROW(INDIRECT(CONCATENATE(\"$\",HLOOKUP(BrewReport!$E$7,$G$1:$K$2,2,FALSE),\"$3:$\",HLOOKUP(BrewReport!$E$7,$G$1:$K$2,2,FALSE),\"$80\"))))+1), ROW(A7))),\"\")","v":"Cara 20 (Blond)"}]
["Maris Otter Ale",8,8,"320","Fyldig, nødder, let orange farve",{"$f":"IFERROR(VLOOKUP(Malt!$A10,BrewReport!$A$9:$C$18,3,FALSE),0)","v":0},{"$f":"F10*N6","v":0},{"$f":"F10*N7","v":0},null,null,{"$f":"F10*N12","v":0},null,"Grp 6",23,null,{"$f":"IFERROR(INDEX($A$3:$A$75, SMALL(IF(ISBLANK(INDIRECT(CONCATENATE(\"$\",HLOOKUP(BrewReport!$E$7,$G$1:$K$2,2,FALSE),\"$3:$\",HLOOKUP(BrewReport!$E$7,$G$1:$K$2,2,FALSE),\"$80\"))), \"\", ROW(INDIRECT(CONCATENATE(\"$\",HLOOKUP(BrewReport!$E$7,$G$1:$K$2,2,FALSE),\"$3:$\",HLOOKUP(BrewReport!$E$7,$G$1:$K$2,2,FALSE),\"$80\")))-MIN(ROW(INDIRECT(CONCATENATE(\"$\",HLOOKUP(BrewReport!$E$7,$G$1:$K$2,2,FALSE),\"$3:$\",HLOOKUP(BrewReport!$E$7,$G$1:$K$2,2,FALSE),\"$80\"))))+1), ROW(A8))),\"\")","v":"Cara Crystal (Gold)"}]
{"$rows_left_out":73}
{"sheet":"Tilsætninger","index":5,"n_rows":17,"n_cols":5,"rows_kept":17,"cut":false,"hidden":false,"merged":[]}
["Tilsætninger","EBC","EBC Avg.","Udbytte"]
["Sukker",0,0,440]
["Rørsukker","20 - 30",25,420]
["Farin","50 - 75",65,420]
["Muscovado Sukker","80 - 120",100,400]
["Mørk Kandis","80 - 120",80,375]
["Lys Kandis",0,0,375]
["Dansk Honning",40,40,375]
["Appelsinskal",0,0,0]
["Koriander",0,0,0]
{"$rows_left_out":8}
{"sheet":"Gær","index":6,"n_rows":64,"n_cols":10,"rows_kept":64,"cut":false,"hidden":false,"merged":[[61,2,61,5],[63,2,63,5]]}
["Gær Navn","Beskrivelse","Flocculation","Attenuation %","Attenuation Avg.","Temp. Range °C","Alc. Tolerance %",null,"Temp.(°C)","CO2"]
[null,null,null,null,null,null,null,null,0,1.71]
["Wyeast XL1007 German Ale",null,"Low","73 - 77",75,"13 - 20",11,null,1,1.66]
["Wyeast XL1010 American Wheat",null,"Low","74 - 78",76,"14 - 23",10,null,2,1.61]
["Wyeast XL1028 London Ale",null,"Low - Medium","73 - 77",75,"15 - 22",11,null,3,1.56]
["Wyeast XL1056 American Ale","Well balanced. Ferments dry, finishes soft.","Low - Medium","73 - 77",75,"15 - 22",11,null,4,1.51]
["Wyeast XL1084 Irish Ale",null,"Medium","71 - 75",73,"16 - 22",12,null,5,1.46]
["Wyeast XL1098 British Ale",null,"Medium","73 - 75",74,"18 - 22",10,null,6,1.39]
["Wyeast XL1099 Whitbread Ale",null,"Medium - High","68 - 72",70,"18 - 24",10,null,7,1.32]
["Wyeast XL1187 Ringwood Ale","A malty, complex profile that clears well.","High","68 - 72",70,"18 - 23",10,null,8,1.28]
{"$rows_left_out":55}
{"sheet":"Humle","index":7,"n_rows":38,"n_cols":24,"rows_kept":38,"cut":false,"hidden":false,"merged":[[37,0,37,3],[36,12,36,18],[36,19,36,28],[2,13,2,23],[2,12,5,12],[34,12,34,18],[0,15,1,23],[0,12,1,14],[34,19,34,28],[3,13,5,13],[3,14,5,14],[3,15,5,15],[3,16,5,16],[3,17,5,17],[3,18,5,18],[3,19,5,19],[3,20,5,20],[3,21,5,21],[3,22,5,22],[3,23,5,23]]}
["Humletyper","Blomst / Pellet","Alfa Range %","IBU Avg.","Beta Range %","Co-humulione %","Usage","Brewing usage","Used in","Aroma","Substitutes",null,"Glenn Tinseth's website",null,null,"Decimal Alpha Acid Utilization vs. Boil Time and Wort Original Gravity"]
[null,null,null,null,null,null,"B/A"]
["Admiral","B / P","13,0 - 16,0",14,"4,0 - 6,0","37 - 45","Ba","A high alpha hop with balanced bitterness and an acceptable aroma profile; mainly bittering, but a versatile replacement for both high alpha and dual purpose varieties","English-style Ale","Pleasant, resinous hop aroma with hints of citrus (orange) and herbal flavors","Target, Northdown, Challenger",null,"Boil Time (min)","Original Gravity"]
["Amarillo","P","8,0 - 11,0",8.5,"6,0 - 7,0","21 - 24","BA","Unknown origin, but character similar to Cascade. Used for both bitterness and aroma","IPAs, Ales","Floral, tropical, and citrus (lemon, orange and grapefruit)","Cascade, Centennial, Simcoe",null,null,1.03,1.04,1.05,1.06,1.07,1.08,1.0900000000000001,1.1000000000000001,1.1100000000000001,1.1200000000000001,1.1299999999999999]
["Bobek","P","3,5 - 7,0",5,"4 - 6,1","27 - 31","A","Bobek is a diploid hybrid between Northern Brewer and a TG seedling of unknown origin.","Belgian Ales and Lagers, ESBs, and Pilsners.","Noble aroma of delicate spicy, floral, and piney notes.","Styrian Golding, UK or US Fuggle, Willamette"]
["Bramling X","B","5,0 - 7,8",4.3,"2,3 - 3,5",34,"A","Developed in 1927 from commercial Goldings and wild hop variety.","ESB, Bitters, Pale Ale","Mild, fruity, currant aroma.","East Kent Goldings, Progress, Whitbred"]
["Brewer's Gold","B / P","5,5 - 10,0",5.8,"3,5 - 4,5","37 - 40","B","Traditional bittering hop. An English variety and sibling of Bullion","English ales and heavy German lagers.","Spicy, fruity characteristics, black currant","Northern Brewer, Galena, Chinook, Eroica, Nugget",null,0,0,0,0,0,0,0,0,0,0,0,0]
["Cascade","B / P","4,5 - 7,0",6.3,"4,5 - 7,0","33 - 40","BA","A hop with Northern Brewers Heritage","American ales and lagers","Strong spicy, floral, grapefruit character","Centennial",null,3,3.4000000000000002E-2,3.1E-2,2.9000000000000001E-2,2.5999999999999999E-2,2.4E-2,2.1999999999999999E-2,0.02,1.7999999999999999E-2,1.7000000000000001E-2,1.4999999999999999E-2,1.4E-2]
["Centennial","B / P","9,5 - 11,5",9.1999999999999993,"3,5 - 4,5","28 - 30","BA","General purpose bittering, aroma. Derived from 3/4 Brewer's Gold and contributions of Fuggle, East Kent Golding and others","American ales and Wheats","Floral, citrus aroma, spicy, clean bittering flavor","Cascade, Chinook, Columbus, Galena, Eroica, Nugget, Bullion",null,6,6.5000000000000002E-2,5.8999999999999997E-2,5.3999999999999999E-2,4.9000000000000002E-2,4.4999999999999998E-2,4.1000000000000002E-2,3.7999999999999999E-2,3.5000000000000003E-2,3.2000000000000001E-2,2.9000000000000001E-2,2.5999999999999999E-2]
["Challenger","P","6,5 - 9,0",6.9,"3,2 - 4,2","20 - 25","BA","Variant of Northern Brewers heritage \nUsed for: Both aroma and bittering","Ales and lagers","Fruity in flavor, spicy aroma, blends well",null,null,9,9.1999999999999998E-2,8.4000000000000005E-2,7.6999999999999999E-2,7.0000000000000007E-2,6.4000000000000001E-2,5.8999999999999997E-2,5.3999999999999999E-2,4.9000000000000002E-2,4.4999999999999998E-2,4.1000000000000002E-2,3.6999999999999998E-2]
{"$rows_left_out":29}
{"sheet":"Typer","index":8,"n_rows":102,"n_cols":19,"rows_kept":102,"cut":false,"hidden":false,"merged":[[1,0,1,1],[0,3,0,18],[0,0,0,2]]}
["Ref.: Beer Judge Certification Program",null,null,"2008 BJCP Style Guidelines"]
["Style #",null,"Style Name","OG high","OG low","FG high","FG low","ABV high","ABV low","EBC high","EBC low","IBU high","IBU low","RBR","CO2 High","CO2 Low","CO2 Avg.","Yeast Type","Brief"]
[]
[1,"A","Lite American Lager",1040,1028,1008,998,4.2,2.8,6,4,12,8,0.34,2.73,2.57,{"$f":"(P4+O4)/2","v":2.65},"Lager"]
[1,"B","Standard American Lager",1050,1040,1010,1004,5.3,4.2,8,4,15,8,0.27,2.73,2.57,2.65,"Lager"]
[1,"C","Premium American Lager",1056,1046,1012,1008,6,4.5999999999999996,12,4,25,15,0.4,2.73,2.57,2.65,"Lager"]
[1,"D","Munich Helles",1051,1045,1012,1008,5.4,4.7,10,6,22,16,0.4,2.68,2.2599999999999998,2.4699999999999998,"Lager"]
[1,"E","Dortmunder Export",1056,1048,1015,1010,6,4.8,12,8,30,23,0.5,2.57,2.57,2.57,"Lager"]
[2,"A","German Pilsner",1050,1044,1013,1008,5.2,4.4000000000000004,10,4,45,25,0.75,2.52,2.52,2.52,"Lager"]
[2,"B","Bohemian Pilsner",1056,1044,1017,1013,5.4,4.2,12,7,45,35,0.74,2.5,2.2999999999999998,2.4,"Lager"]
{"$rows_left_out":93}
{"sheet":"Malt X-ref.","index":9,"n_rows":39,"n_cols":10,"rows_kept":39,"cut":false,"hidden":false,"merged":[[0,0,0,9]]}
[]
[null,"WEYERMANN","Castle Malting","MUNTONS","BRIESS","FAWCETT","BAIRDS","CRISP","GAMBRINUS","DINGEMANS"]
[null,"(German)","(Belgian)","(British)","(American)","(British)","(British)","(British)","(Canadian)","(Belgian)"]
[null,"Bohemian Pilsner","Pilsner","Lager","Pilsner","Lager",null,"Lager",null,"Pilsen"]
[null,"Pale","Pale Ale","Pale","Brewers 2-Row","Pale Ale","Pale Ale","Pale","Pale","Pale Ale"]
[null,null,"Maris Otter Ale","Maris Otter",null,"Maris Otter",null,null,"ESB"]
[null,"Vienna","Vienna","Mild","Vienna","Vienna","Vienna","Ashburne/Vienna"]
[null,"Abbey","Abbey"]
[null,"Munich Type I, Light","Munich Light",null,"Bonlander",null,null,null,null,"Munich"]
[null,"Munich Type II, Dark","Munich",null,"Munich 10L",null,null,null,"Munich 10L"]
{"$rows_left_out":30}
{"sheet":"Indkøb","index":10,"n_rows":11,"n_cols":5,"rows_kept":11,"cut":false,"hidden":false,"merged":[[7,2,7,3]]}
[]
[null,"Varenavn","Antal","Pris pr. stk.","Pris i alt DKK"]
[null,"Pale Ale Malt EBC 7-9: 1 gram","+ 5.500,00 -",0.02,110]
[null,"Cascade, Alpha: 6,3%: 1 gram","+ 65,00 -",0.5,32.5]
[null,"Mangrove Jack's Californian Lager M54","+ 1,00 -",20,20]
[null,"Mangrove Jack´s New World Strong Ale M42","+ 1,00 -",20,20]
[null,"Fragt",null,null,25]
[null,"Vareværdi i alt DKK",null,null,{"$f":"SUM(E3:E7)","v":207.5}]
[]
[]
{"$rows_left_out":2}
{"sheet":"Links","index":11,"n_rows":29,"n_cols":2,"rows_kept":29,"cut":false,"hidden":false,"merged":[[24,1,24,5]]}
[]
["Shopping:","http://brygladen.com/"]
[null,"http://www.hjemmebryggeren.dk/"]
[null,"http://www.albryg.dk/"]
[null,"http://www.bryglageret.dk/"]
[null,"https://brygforretningen.dk/"]
[]
["Opskrifter:","http://www.candisyrup.com/recipes.html"]
[null,"http://www.castlemalting.com/CastleMaltingBeerRecipes.asp?P=94&Language=Danish"]
[]
{"$rows_left_out":19}