{"text_format":"1","workbook":"xlsx","n_sheets":14,"sheets":["BrewReport","INFO","Labels","Data","Omregninger","Malt","Malt X-ref.","Humle","Humle X-ref.","Tilsætninger","Gær","Typer","Indkøb","Links"],"not_rendered":{"charts":1,"images":6,"macros":1,"external_links":0,"defined_names":3,"comments":5,"pivot_tables":0},"unopened":[],"bounds":{"document_bytes":16777216,"sheet_cells":100000,"rows_first":2000,"rows_last":500,"rows_between":2000,"halvings":0,"cell_chars":16384,"cell_head_chars":4096},"cells_cut":0,"cells_raw":0,"read":"whole","date_system":"1900"}

{"sheet":"BrewReport","index":0,"n_rows":81,"n_cols":13,"rows_kept":81,"cut":false,"hidden":false,"merged":[[75,4,75,6],[2,0,2,2],[80,1,80,6],[9,0,9,1],[10,0,10,1],[11,0,11,1],[12,0,12,1],[13,0,13,1],[14,0,14,1],[15,0,15,1],[16,0,16,1],[17,0,17,1],[74,2,74,3],[74,4,74,6],[79,4,79,6],[78,4,78,6],[42,0,42,5],[77,4,77,6],[76,4,76,6],[79,1,79,3],[78,1,78,3],[77,1,77,3],[76,1,76,3],[75,1,75,3],[31,9,31,10],[1,0,1,2],[53,0,53,2],[52,0,52,2],[51,0,51,2],[50,0,50,2],[49,0,49,2],[48,0,48,2],[47,0,47,2],[46,0,46,2],[45,0,45,2],[44,0,44,2],[39,0,39,2],[38,0,38,2],[37,0,37,2],[36,0,36,2],[35,0,35,2],[6,0,6,3],[2,3,2,4],[8,0,8,1],[40,0,40,2],[5,0,5,2],[3,0,3,2],[38,7,38,8],[69,11,69,12],[70,11,71,12],[48,8,48,12],[50,9,50,12],[2,6,2,7],[26,7,26,8],[27,9,27,10],[29,7,29,8],[30,7,30,8],[31,7,31,8],[5,6,5,7],[7,9,7,10],[33,9,33,10],[12,7,12,8],[11,7,11,8],[10,7,10,8],[8,7,8,8],[6,7,6,12],[16,7,16,8],[2,10,2,12],[15,7,15,8],[23,9,23,10],[22,9,22,10],[32,9,32,10],[32,7,32,8],[33,7,33,8],[43,7,43,10],[37,7,37,8],[79,10,79,12],[80,7,80,9],[80,10,80,12],[78,7,78,9],[78,10,78,12],[76,7,76,9],[76,10,76,12],[77,7,77,9],[77,10,77,12],[79,7,79,9],[75,7,75,9],[75,10,75,12],[66,9,66,12],[63,7,63,8],[71,9,71,10],[71,7,71,8],[44,11,44,12],[44,9,44,10],[45,9,45,10],[68,11,68,12],[68,9,68,10],[57,8,57,12],[54,9,54,10],[52,9,52,10],[0,0,0,2],[0,3,0,12],[50,3,50,4],[20,9,20,10],[21,9,21,10],[47,3,47,4],[18,0,18,2],[38,9,38,10],[35,7,35,8],[35,9,35,10],[42,7,42,12],[34,9,34,10],[1,3,1,12],[7,7,7,8],[18,7,18,8],[9,7,9,8],[37,9,37,10],[25,9,25,10],[26,9,26,10],[66,7,66,8],[55,0,55,5],[40,7,40,8],[62,9,62,10],[51,9,51,10],[61,9,61,10],[54,7,54,8],[53,7,53,8],[65,7,65,12],[60,11,60,12],[54,11,54,12],[47,7,47,12],[27,7,27,8],[28,7,28,8],[28,9,28,10],[3,9,3,10],[34,7,34,8],[36,9,36,10],[56,2,56,5],[74,7,74,9],[74,10,74,12],[39,9,39,10],[70,9,70,10],[44,7,44,8],[45,7,45,8],[72,7,72,8],[72,9,72,10],[72,11,72,12],[67,11,67,12],[45,11,45,12],[51,11,51,12],[56,7,56,12],[39,7,39,8],[69,9,69,10],[60,9,60,10],[49,7,50,8],[3,6,3,7],[21,7,21,8],[22,7,22,8],[23,7,23,8],[24,7,24,8],[14,7,14,8],[13,7,13,8],[24,9,24,10],[25,7,25,8],[5,9,5,10],[67,0,72,5],[58,7,59,8],[58,9,58,12],[59,9,59,12],[40,9,40,10],[61,11,62,12],[62,7,62,8],[30,9,30,10],[29,9,29,10],[49,9,49,12],[61,7,61,8],[63,9,63,10],[63,11,63,12],[52,11,53,12],[67,9,67,10],[66,1,66,2],[66,3,66,5],[53,9,53,10],[52,7,52,8],[36,7,36,8],[70,7,70,8],[69,7,69,8],[68,7,68,8],[67,7,67,8]]}
["Bryggeri:",null,null,"Hulebækkens bryghus"]
["Bryg navn:",null,null,"Forårsvelsignelse"]
["Bryg nr.:",null,null,29,null,"Type:","Weizenbock",null,{"$f":"IF($G$3=\"\",\"\",CONCATENATE(VLOOKUP($G$3,Typer!$C$4:$P$125,2,FALSE),VLOOKUP($G$3,Typer!$C$4:$P$125,3,FALSE)))","v":"10C"},"Dato:","2017-04-17"]
["Typiske data:",null,null,"EBC",{"$f":"IF($G$3=\"\",\"\",CONCATENATE(VLOOKUP($G$3,Typer!$C$4:$P$125,10,FALSE),\" - \",VLOOKUP($G$3,Typer!$C$4:$P$125,11,FALSE)))","v":"10 - 12"},"OG",{"$f":"IF($G$3=\"\",\"\",CONCATENATE(VLOOKUP($G$3,Typer!$C$3:$T$125,4,FALSE),\" - \",VLOOKUP($G$3,Typer!$C$3:$T$125,5,FALSE)))","v":"1090 - 1064"},null,"IBU",{"$f":"IFERROR(IF($G$3=\"\",\"\",CONCATENATE(VLOOKUP($G$3,Typer!$C$4:$P$125,12,FALSE),\" - \",VLOOKUP($G$3,Typer!$C$4:$P$125,13,FALSE))),\"\")","v":"30 - 15"},null,"RBR",{"$f":"IFERROR(IF($G$3=\"\",\"\",VLOOKUP($G$3,Typer!$C$4:$P$125,14,FALSE)),\"\")","v":0.28999999999999998}]
[]
["Dette brygs data:",null,null,null,{"$f":"IF(Data!G26=0,\"\",Data!G26)","v":9.9},"OG",{"$f":"IF(D19=0,\"\",IF(D50=\"\",IF(K3=\"\",Data!I26,D49),IF(K3=\"\",Data!I26,D50)))","v":1085},null,"IBU",{"$f":"IF(Data!I55=0,\"\",Data!I55)","v":12.367999999999999},null,"RBR",{"$f":"IF(AND(J50=\"\",J51=\"\"),\"\",IF(D52=\"\",IF(J6=\"\",\"\",(Data!I55/(G6-1000)*(1+((MAX(Data!G29:G30)/100)-0.7655)))),(Data!I55/(G6-1000)*(1+((D53/100)-0.7655)))))","v":3.4121129411764706E-2}]
["Ingredienser",null,null,null,"fra:","Hjemmebryggeren",null,"Mæskning"]
["Malttype",null,"EBC","Vægt","Enhed","Priser",null,"Proces",null,"Tid",null,"Temp.","Starttider (tt:mm)"]
["Pale Ale",null,{"$f":"IF(A9=\"\",\"\",VLOOKUP(A9,Malt!$A$3:$C$75,3,FALSE))","v":8},3,"kg",{"$f":"IFERROR(VLOOKUP($A9,Malt!$A$3:$K$75,COLUMN(INDIRECT(CONCATENATE(HLOOKUP($F$7,Malt!$G$1:$K$2,2,FALSE),2))),FALSE),\"\")","v":60},null,null,null,{"$f":"SUM(J10:J19)+L10","v":143},"min","°C","11:30:00"]
["Wheat",null,{"$f":"IF(A10=\"\",\"\",VLOOKUP(A10,Malt!$A$3:$C$75,3,FALSE))","v":3},2.5,"kg",{"$f":"IFERROR(VLOOKUP($A10,Malt!$A$3:$K$75,COLUMN(INDIRECT(CONCATENATE(HLOOKUP($F$7,Malt!$G$1:$K$2,2,FALSE),2))),FALSE),\"\")","v":50},null,"Syre pause",null,10,"min",45,{"$f":"IF(AND($M$9>0,J9>0,J10>0),M9+TIME(,L10*Data!E7,),IF(AND($M$9>0,J8>0,J10>0),M8+TIME(,J8,),IF(AND($M$9>0,J7>0,J10>0),M7+TIME(,J7,),IF(AND($M$9>0,J6>0,J10>0),M6+TIME(,J6,),\"\"))))","v":"12:15:00"}]
["Wheat Flaked",null,{"$f":"IF(A11=\"\",\"\",VLOOKUP(A11,Malt!$A$3:$C$75,3,FALSE))","v":5},0.5,"kg",{"$f":"IFERROR(VLOOKUP($A11,Malt!$A$3:$K$75,COLUMN(INDIRECT(CONCATENATE(HLOOKUP($F$7,Malt!$G$1:$K$2,2,FALSE),2))),FALSE),\"\")","v":10},null,"Indmæskning",null,12,"min",{"$f":"IF(J11=0,\"\",CONCATENATE(L10,\" - \",L12))","v":"45 - 57"},{"$f":"IF(AND($M$9>0,J10>0,J11>0),M10+TIME(,J10,),IF(AND($M$9>0,J9>0,J11>0),M9+TIME(,J9,),IF(AND($M$9>0,J8>0,J11>0),M8+TIME(,J8,),IF(AND($M$9>0,J7>0,J11>0),M7+TIME(,J7,),\"\"))))","v":"12:25:00"}]
[null,null,{"$f":"IF(A12=\"\",\"\",VLOOKUP(A12,Malt!$A$3:$C$75,3,FALSE))","v":""},null,"kg",{"$f":"IFERROR(VLOOKUP($A12,Malt!$A$3:$K$75,COLUMN(INDIRECT(CONCATENATE(HLOOKUP($F$7,Malt!$G$1:$K$2,2,FALSE),2))),FALSE),\"\")","v":""},null,"Proteinpause  ( 57°C )",null,10,"min",57,{"$f":"IF(AND($M$9>0,J11>0,J12>0),M11+TIME(,J11,),IF(AND($M$9>0,J10>0,J12>0),M10+TIME(,J10,)+TIME(,L12-L10,),IF(AND($M$9>0,J9>0,J12>0),M9+TIME(,J9,)+TIME(,L12-L19,),IF(AND($M$9>0,J8>0,J12>0),M8+TIME(,J8,)+TIME(,L12-L8,),\"\"))))","v":"12:37:00"}]
[null,null,{"$f":"IF(A13=\"\",\"\",VLOOKUP(A13,Malt!$A$3:$C$75,3,FALSE))","v":""},null,"kg",{"$f":"IFERROR(VLOOKUP($A13,Malt!$A$3:$K$75,COLUMN(INDIRECT(CONCATENATE(HLOOKUP($F$7,Malt!$G$1:$K$2,2,FALSE),2))),FALSE),\"\")","v":""},null,"Mæskning 1",null,30,"min",62,{"$f":"IF(AND($M$9>0,J12>0,J13>0),M12+TIME(,J12,)+TIME(,L13-L12,),IF(AND($M$9>0,J11>0,J13>0),M11+TIME(,J11,)+TIME(,L12-L11,),IF(AND($M$9>0,J10>0,J13>0),M10+TIME(,J10,)+TIME(,L13-L20,),IF(AND($M$9>0,J9>0,J13>0),M9+TIME(,J9,)+TIME(,L13-L9,),\"\"))))","v":"12:52:00"}]
[null,null,{"$f":"IF(A14=\"\",\"\",VLOOKUP(A14,Malt!$A$3:$C$75,3,FALSE))","v":""},null,"kg",{"$f":"IFERROR(VLOOKUP($A14,Malt!$A$3:$K$75,COLUMN(INDIRECT(CONCATENATE(HLOOKUP($F$7,Malt!$G$1:$K$2,2,FALSE),2))),FALSE),\"\")","v":""},null,"Mæskning 2",null,null,"min",null,{"$f":"IF(AND($M$9>0,J13>0,J14>0),M13+TIME(,J13,)+TIME(,L14-L13,),IF(AND($M$9>0,J12>0,J14>0),M12+TIME(,J12,)+TIME(,L14-L12,),IF(AND($M$9>0,J11>0,J14>0),M11+TIME(,J11,)+TIME(,L14-L11,),IF(AND($M$9>0,J10>0,J14>0),M10+TIME(,J10,)+TIME(,L14-L10,),\"\"))))","v":""}]
[null,null,{"$f":"IF(A15=\"\",\"\",VLOOKUP(A15,Malt!$A$3:$C$75,3,FALSE))","v":""},null,"kg",{"$f":"IFERROR(VLOOKUP($A15,Malt!$A$3:$K$75,COLUMN(INDIRECT(CONCATENATE(HLOOKUP($F$7,Malt!$G$1:$K$2,2,FALSE),2))),FALSE),\"\")","v":""},null,"Mæskning 3",null,null,"min",null,{"$f":"IF(AND($M$9>0,J14>0,J15>0),M14+TIME(,J14,)+TIME(,L15-L14,),IF(AND($M$9>0,J13>0,J15>0),M13+TIME(,J13,)+TIME(,L15-L13,),IF(AND($M$9>0,J12>0,J15>0),M12+TIME(,J12,)+TIME(,L15-L22,),IF(AND($M$9>0,J11>0,J15>0),M11+TIME(,J11,)+TIME(,L15-L11,),\"\"))))","v":""}]
[null,null,{"$f":"IF(A16=\"\",\"\",VLOOKUP(A16,Malt!$A$3:$C$75,3,FALSE))","v":""},null,"kg",{"$f":"IFERROR(VLOOKUP($A16,Malt!$A$3:$K$75,COLUMN(INDIRECT(CONCATENATE(HLOOKUP($F$7,Malt!$G$1:$K$2,2,FALSE),2))),FALSE),\"\")","v":""},null,"Forsukring",null,30,"min",72,{"$f":"IF(AND($M$9>0,J15>0,J16>0),M15+TIME(,J15,)+TIME(,L16-L15,),IF(AND($M$9>0,J14>0,J16>0),M14+TIME(,J14,)+TIME(,L16-L14,),IF(AND($M$9>0,J13>0,J16>0),M13+TIME(,J13,)+TIME(,L16-L13,),IF(AND($M$9>0,J12>0,J16>0),M12+TIME(,J12,)+TIME(,L16-L12,),IF(AND($M$9>0,J11>0,J16>0),M11+TIME(,J11,)+TIME(,L16-L10,),\"\")))))","v":"13:32:00"}]
[null,null,{"$f":"IF(A17=\"\",\"\",VLOOKUP(A17,Malt!$A$3:$C$75,3,FALSE))","v":""},null,"kg",{"$f":"IFERROR(VLOOKUP($A17,Malt!$A$3:$K$75,COLUMN(INDIRECT(CONCATENATE(HLOOKUP($F$7,Malt!$G$1:$K$2,2,FALSE),2))),FALSE),\"\")","v":""},null,"Afmæskning",null,5,"min",78,{"$f":"IF(AND($M$9>0,J16>0,J17>0),M16+TIME(,J16,)+TIME(,L17-L16,),IF(AND($M$9>0,J15>0,J17>0),M15+TIME(,J15,)+TIME(,L17-L15,),IF(AND($M$9>0,J14>0,J17>0),M14+TIME(,J14,)+TIME(,L17-L14,),IF(AND($M$9>0,J13>0,J17>0),M13+TIME(,J13,)+TIME(,L17-L13,),\"\"))))","v":"14:08:00"}]
[null,null,{"$f":"IF(A18=\"\",\"\",VLOOKUP(A18,Malt!$A$3:$C$75,3,FALSE))","v":""},null,"kg",{"$f":"IFERROR(VLOOKUP($A18,Malt!$A$3:$K$75,COLUMN(INDIRECT(CONCATENATE(HLOOKUP($F$7,Malt!$G$1:$K$2,2,FALSE),2))),FALSE),\"\")","v":""},null,null,null,null,null,null,{"$f":"IF(AND($M$9>0,J17>0,J18>0),M17+TIME(,J17,)+TIME(,L18-L17,),IF(AND($M$9>0,J16>0,J18>0),M16+TIME(,J16,)+TIME(,L18-L16,),IF(AND($M$9>0,J15>0,J18>0),M15+TIME(,J15,)+TIME(,L18-L15,),IF(AND($M$9>0,J14>0,J18>0),M14+TIME(,J14,)+TIME(,L18-L14,),\"\"))))","v":""}]
["Total",null,null,{"$f":"SUM(D9:D18)","v":6},"kg",{"$f":"IF(SUM(F9:F18)=0,\"\",SUM(F9:F18))","v":120},null,"Fraløb",null,1,"min",78,{"$f":"IF(AND($M$9>0,J18>0,J19>0),M18+TIME(,J18,)+TIME(,L19-L18,),IF(AND($M$9>0,J17>0,J19>0),M17+TIME(,J17,)+TIME(,L19-L17,),IF(AND($M$9>0,J16>0,J19>0),M16+TIME(,J16,)+TIME(,L19-L16,),IF(AND($M$9>0,J15>0,J19>0),M15+TIME(,J15,)+TIME(,L19-L15,),\"\"))))","v":"14:13:00"}]
[]
["Humletype","B/P","% og Anv.","Vægt","Enhed",null,null,"Kogning",null,"Tid før slut",null,"Enhed","Starttider (tt:mm)"]
["Bitterhumle",null,null,{"$f":"SUM(D23:D33)","v":50},null,null,null,"I alt",null,90,null,"min",{"$f":"IF(M19<>\"\",M19+TIME(,J19+5,),\"\")","v":"14:19:00"}]
["Perle","Pellet",{"$f":"IF(A23=\"\",\"\",CONCATENATE(Data!G42,\"% - \",VLOOKUP(A23,Humle!$A$2:$I$41,8,FALSE)))","v":"4% - BA"},30,"gram","Justeres evt.",null,{"$f":"IF(A23=\"\",\"\",A23)","v":"Perle"},null,60,null,"min.",{"$f":"IF(AND($M$22>0,$J$22>0,J23<>\"\"),$M$22+(TIME(,$J$22,)-TIME(,J23,)),\"\")","v":"14:49:00"}]
[null,null,{"$f":"IF(A24=\"\",\"\",CONCATENATE(Data!G43,\"% - \",VLOOKUP(A24,Humle!$A$2:$I$41,8,FALSE)))","v":""},null,"gram",null,null,{"$f":"IF(A24=\"\",\"\",A24)","v":""},null,null,null,"min.",{"$f":"IF(AND($M$22>0,$J$22>0,J24<>\"\"),$M$22+(TIME(,$J$22,)-TIME(,J24,)),\"\")","v":""}]
[null,null,{"$f":"IF(A25=\"\",\"\",CONCATENATE(Data!G44,\"% - \",VLOOKUP(A25,Humle!$A$2:$I$41,8,FALSE)))","v":""},null,"gram",null,null,{"$f":"IF(A25=\"\",\"\",A25)","v":""},null,null,null,"min.",""]
["Smagshumle"]
[null,null,{"$f":"IF(A27=\"\",\"\",CONCATENATE(Data!G46,\"% - \",VLOOKUP(A27,Humle!$A$2:$I$41,8,FALSE)))","v":""},null,"gram",null,null,{"$f":"IF(A27=\"\",\"\",A27)","v":""},null,null,null,"min",""]
[null,null,{"$f":"IF(A28=\"\",\"\",CONCATENATE(Data!G47,\"% - \",VLOOKUP(A28,Humle!$A$2:$I$41,8,FALSE)))","v":""},null,"gram",null,null,{"$f":"IF(A28=\"\",\"\",A28)","v":""},null,null,null,"min",""]
[null,null,{"$f":"IF(A29=\"\",\"\",CONCATENATE(Data!G48,\"% - \",VLOOKUP(A29,Humle!$A$2:$I$41,8,FALSE)))","v":""},null,"gram",null,null,{"$f":"IF(A29=\"\",\"\",A29)","v":""},null,null,null,"min",""]
["Aromahumle"]
["Perle","Pellet",{"$f":"IF(A31=\"\",\"\",CONCATENATE(Data!G50,\"% - \",VLOOKUP(A31,Humle!$A$2:$I$41,8,FALSE)))","v":"4% - BA"},20,"gram",null,null,{"$f":"IF(A31=\"\",\"\",A31)","v":"Perle"},null,10,null,"min","15:39:00"]
[null,null,{"$f":"IF(A32=\"\",\"\",CONCATENATE(Data!G51,\"% - \",VLOOKUP(A32,Humle!$A$2:$I$41,8,FALSE)))","v":""},null,"gram",null,null,{"$f":"IF(A32=\"\",\"\",A32)","v":""},null,null,null,"min",""]
[null,null,{"$f":"IF(A33=\"\",\"\",CONCATENATE(Data!G52,\"% - \",VLOOKUP(A33,Humle!$A$2:$I$41,8,FALSE)))","v":""},null,"gram",null,null,{"$f":"IF(A33=\"\",\"\",A33)","v":""},null,null,null,"min",""]
["Andet",null,null,null,null,"Manuel indtast"]
[null,null,null,null,"gram",null,null,{"$f":"IF($A$35=\"\",\"\",$A$35)","v":""},null,null,null,"min",""]
["Rørsukker",null,null,1000,"gram",null,null,{"$f":"IF($A$36=\"\",\"\",$A$36)","v":"Rørsukker"},null,0,null,"min","15:49:00"]
[null,null,null,null,"gram",null,null,{"$f":"IF($A$37=\"\",\"\",$A$37)","v":""},null,null,null,"min",""]
[null,null,null,null,"gram",null,null,{"$f":"IF($A$38=\"\",\"\",$A$38)","v":""},null,null,null,"min",""]
[null,null,null,null,"gram",null,null,{"$f":"IF($A$39=\"\",\"\",$A$39)","v":""},null,null,null,"min",""]
["Appelsinskal",null,null,30,"gram",null,null,{"$f":"IF($A$40=\"\",\"\",$A$40)","v":"Appelsinskal"},null,0,null,"min","15:49:00"]
["Klar Urt",null,null,0,"gram",null,null,{"$f":"IF($A$41=\"\",\"\",$A$41)","v":"Klar Urt"},null,0,null,"min",{"$f":"IF($M$22=\"\",\"\",IF(AND($M$22>0,$J$22>0,J41<>\"\"),$M$22+(TIME(,$J$22,)-TIME(,J41,)),\"\"))","v":"15:49:00"}]
[]
["Målinger",null,null,null,null,null,null,"Køling"]
[null,null,null,"Målt","Enhed",null,null,null,null,null,null,"Enhed"]
["Udbytte efter mæskning",null,null,19,"liter",1069,null,"Tid",null,30,null,"min"]
["Udbytte efter tilsætning af sukker m.m.",null,null,18,"liter",1085,null,"Nedkøling til",null,25,null,"°C"]
["Udbytte efter gæring og omstikning",null,null,15,"liter"]
["Bryggedato:",null,null,{"$f":"IF(K3=\"\",\"\",K3)","v":"2017-04-17"},null,{"$f":"IF(M9<>\"\",CONCATENATE(\"Færdig ca. kl.: \",TEXT(CEILING(M22+TIME(,J22,)+TIME(,J45,),\"0:15\"),\"tt:mm\")),\"Færdig ca. kl.: \")","v":"Færdig ca. kl.: 16:30"},null,"Gæring - 1. ferm."]
["Vægtfylde efter mæskning",null,null,1069,"Oeschle",{"$f":"IF(D49=\"\",\"\",CONCATENATE(\"Effektivitet: \",ROUND((Data!D24*100),0),\" %\"))","v":"Effektivitet: 72 %"},null,"Kommentar"]
["Vægtfylde før gæring",null,null,1085,"Oeschle",{"$f":"IF(D50=\"\",\"\",CONCATENATE(\"Effektivitet: \",ROUND((Data!D25*100),0),\" %\"))","v":"Effektivitet: 68 %"},null,"Tilsat gær type (2 mulige):",null,"Brewolution Wheat Beer"]
["Flaskedato:",null,null,{"$f":"IF(J71=\"\",\"\",J71)","v":""}]
["Vægtfylde efter gæring",null,null,1012,"Oeschle",null,null,"Gæringstemperatur                      °C",23,"Dato",null,"Gærer i spand"]
["Forgæringsgrad",null,null,null,"%",{"$f":"IF(Data!I29=\"\",\"\",CONCATENATE(\"Estimeret: \",ROUND((Data!I29),1),\" %\"))","v":"Estimeret: 6,5 %"},null,"Gæring i gang",null,null,null,"?"]
["Alkohol indhold",null,null,{"$f":"IF(D50=0,\"\",IF(D52=0,\"\",ROUND(((D50-D52)/7.5)+(IF(J69=0,0,(((ROUND(J69/(IF(D47=0,IF(D46=0,D45,D46),D47)),1))-2)/10))),1)))","v":9.6999999999999993},"% Vol.",{"$f":"IF(D54=\"\",CONCATENATE(\"Genstande: \",Data!I36),CONCATENATE(\"Genstande: \",Data!I37))","v":"Genstande: 3,2"},null,"Gæring færdig"]
[null,null,null,null,null,null,null,"Tid ",null,{"$f":"IF(J54=0,0,(J54-J53))","v":0},null,"dage"]
["Tapning - fordelt på flaskestørrelse"]
["Label Farve / Kapsel",null,null,null,null,null,null,"Modning - 2. ferm."]
["Flasker","à","2 liter",null,{"$f":"D58*2","v":0},"Liter",null,"Kommentar"]
["Flasker","à","1 liter",null,{"$f":"D59","v":0},"Liter",null,"Tilsat gær type (2 mulige):"]
["Flasker","à","0,75 liter",3,{"$f":"D60*0.75","v":2.25},"Liter"]
["Flasker","à","0,66 liter",null,{"$f":"D61*0.66","v":0},"Liter",null,"Modningstemperatur                    °C",23,"Dato",null,"Modner i spand"]
["Flasker","à","0,5 liter",24,{"$f":"D62*0.5","v":12},"Liter",null,"Modning fra",null,null,null,"?"]
["Flasker","à","0,33 liter",1,{"$f":"D63*0.33","v":0.33},"Liter",null,"Modning til"]
["Flasker","à","0,25 liter",null,{"$f":"D64*0.25","v":0},"Liter",null,"Tid ",null,{"$f":"IF(J63=0,0,(J63-J62))","v":0},null,"dage"]
["Antal flasker i alt",null,null,{"$f":"SUM(D58:D64)","v":28},{"$f":"CONCATENATE(\"=    \",SUM(E58:E64))","v":"=    14,58"},"Liter på flaske"]
[null,null,null,null,null,null,null,"Karbonering - 3. ferm."]
["Brygnoter:","Inspiration:",null,null,null,null,null,"Tilsat gær type:"]
["Det meget spild ved flaskning skyldtes de mæsnings problemer vi havde, Kornet var for fint malet",null,null,null,null,null,null,"Anbefalet mængde sukker til karbonering:",null,{"$f":"IFERROR((IF(G3=\"\",\"\",ROUND((((VLOOKUP(G3,Typer!C3:V125,17,FALSE)-VLOOKUP(I52,Gær!I2:J29,2,FALSE))*4)*(IF(D47=\"\",IF(D46=0,D45,D46),D47))),0))),\"\")","v":205},null,{"$f":"CONCATENATE(\"gram = \",IF(D46=0,\"?\",IF(J68=\"\",0,(ROUND(J68/(IF(D47=\"\",IF(D46=0,D45,D46),D47)),1)))),\" g/ltr.\")","v":"gram = 13,7 g/ltr."}]
[null,null,null,null,null,null,null,"Tilsat sukker",null,null,null,{"$f":"CONCATENATE(\"gram = \",IF(D46=0,\"?\",(ROUND(J69/(IF(D47=\"\",IF(D46=0,D45,D46),D47)),1))),\" g/ltr.\")","v":"gram = 0 g/ltr."}]
[null,null,null,null,null,null,null,null,null,"Dato",null,"Karbonerer i"]
[null,null,null,null,null,null,null,"Karbonering fra",null,null,null,"Flaske"]
[null,null,null,null,null,null,null,"Karbonering til"]
[null,null,null,null,null,null,null,"Tid ",null,{"$f":"IF(J72=0,0,(J72-J71))","v":0},null,"dage"]
[]
["Vurderinger:",null,"Skumkrone",null,"Duft",null,null,"Smag",null,null,"Farve"]
["Ved brygning","-",null,null,"super lækker"]
["Ved omstikning","-"]
["Ved flaskning","-",null,null,"lidt sært"]
["Ved første åbning"]
["Efter nogen tid"]
["Brygget af:","Pierre & Lasse",null,null,null,null,null,"Godkendt til servering d.:"]

{"sheet":"INFO","index":1,"n_rows":24,"n_cols":10,"rows_kept":24,"cut":false,"hidden":false,"merged":[[17,2,19,2],[8,2,9,2],[23,0,23,5],[1,1,1,4],[3,2,6,2],[11,2,15,2],[1,6,1,9],[16,9,17,9],[16,7,17,7],[16,6,17,6],[19,7,20,7],[19,6,20,6],[19,9,20,9]]}
[]
[null,"Brew like a Monk - essentials",null,null,null,null,"Temperature steps in Beer Brewing"]
[null,null,null,null,null,null,"Temperature","Name","Function","Good for"]
[null,null,"Malts and Sugars","Limit malts darker than 100 EBC to 7%"]
[null,null,null,"Use sugar for 10 - 20% of grist",null,null,"35°C","Acid Rest","For undermodified malts;","Bohemian Pilsners"]
[null,null,null,"Sucrose adds alcohol and lightens the beer"]
[null,null,null,"Caramelized sugars add rumminess and complexity",null,null,"45°C","Acid Rest","For better flow during mashing","All beers"]
[]
[null,null,"Mash","Single infusion mash between 63°C and 65°C or step mash.",null,null,"46-53°C","Protein Rest","For clarity – too much degrades head retention","All beers"]
[null,null,null," - Remember protein rest (45 - 60°C) may degrade body and head - see next table ->"]
[null,null,null,null,null,null,"55-58°C","Protein Rest","For head retention","All beers"]
[null,null,"Boil","Use noble hops"]
[null,null,null,"Let bittering hops account for two thirds of hop mass",null,null,"60-65°C","Low Temp. saccharification","For high fermentability; gives a dry finish","German Pilsners"]
[null,null,null,"Aim for BU:GU ratio of about 3 : 8 (RBR = 0,37 - 0,38)"]
[null,null,null," - a little higher for tripels and lower for strong darks",null,null,"66-68°C ","High Temp. saccharification","For less fermentability; gives a sweet finish","Oktoberfest"]
[null,null,null,"If a drinker can name the spice, you have used too much"]
[null,null,null,null,null,null,"77°C","Mash Out","Stops all enzyme action and allows sparging"," All beers"]
[null,null,"Fermentation","Blending yeast strains adds complexity",null,null,null,null,"to be more efficient."]
[null,null,null,"Start fermenting at low temperatures and let the temperature rise"]
[null,null,null,"Allow for longer fermentation and longer cool maturation before bottling.",null,null,"80°C ++ ","MAX. Limit","Mash out above 80°C is not recommended as","All beers"]
[null,null,null,null,null,null,null,null,"unwanted substances are washed from the mash."]
[]
[]
["Herunder kan man f.eks. kopiere inspiration, originale opskrifter eller artikler ind."]

{"sheet":"Labels","index":2,"n_rows":92,"n_cols":22,"rows_kept":92,"cut":false,"hidden":false,"merged":[[91,15,91,21],[91,3,91,9],[68,15,68,21],[68,3,68,9],[45,15,45,21],[45,3,45,9],[22,15,22,21],[22,3,22,9],[79,22,89,23],[51,22,55,23],[54,16,54,17],[56,22,66,23],[71,1,73,11],[74,10,78,11],[77,4,77,5],[85,16,85,20],[51,3,52,9],[51,15,52,21],[56,4,56,8],[56,16,56,20],[56,10,66,11],[57,4,57,5],[57,16,57,17],[74,22,78,23],[71,13,73,23],[88,15,88,21],[74,3,75,9],[65,15,65,21],[62,4,62,8],[62,16,62,20],[74,15,75,21],[77,16,77,17],[85,4,85,8],[79,4,79,8],[79,16,79,20],[80,4,80,5],[80,16,80,17],[81,4,81,8],[81,16,81,20],[79,10,89,11],[88,3,88,9],[89,16,89,17],[89,4,89,5],[82,16,84,20],[82,4,84,8],[66,6,66,9],[66,18,66,21],[89,6,89,9],[89,18,89,21],[28,10,32,11],[25,1,27,11],[51,10,55,11],[42,3,42,9],[42,15,42,21],[65,3,65,9],[54,4,54,5],[47,4,47,9],[47,15,47,18],[48,1,50,11],[48,13,50,23],[34,4,34,5],[33,4,33,8],[33,16,33,20],[39,4,39,8],[39,16,39,20],[35,4,35,8],[58,4,58,8],[58,16,58,20],[43,16,43,17],[43,18,43,21],[66,4,66,5],[66,16,66,17],[10,10,20,11],[10,16,10,20],[16,16,16,20],[11,4,11,5],[11,16,11,17],[12,16,12,20],[12,4,12,8],[19,15,19,21],[20,4,20,5],[20,6,20,9],[0,1,0,23],[1,3,1,9],[5,3,6,9],[5,10,9,11],[5,15,6,21],[5,22,9,23],[8,4,8,5],[8,16,8,17],[2,13,4,23],[2,1,4,11],[33,22,43,23],[35,16,35,20],[59,16,61,20],[59,4,61,8],[13,16,15,20],[36,16,38,20],[36,4,38,8],[20,18,20,21],[20,16,20,17],[13,4,15,8],[33,10,43,11],[34,16,34,17],[19,3,19,9],[16,4,16,8],[28,3,29,9],[28,15,29,21],[25,13,27,23],[28,22,32,23],[31,16,31,17],[31,4,31,5],[43,4,43,5],[43,6,43,9],[10,22,20,23],[10,4,10,8]]}
[null,"FLASKE-ETIKETTER"]
[null,null,null,"Udfyldes automatisk fra BrewReport til denne Label "]
[]
[]
[]
[null,null,null,{"$f":"IF(BrewReport!D2<>\"\",CONCATENATE(BrewReport!D2,\" - \",BrewReport!G3),IF(BrewReport!G3=\"\",\"\",BrewReport!G3))","v":"Forårsvelsignelse - Weizenbock"},null,null,null,null,null,null,null,null,null,null,null,{"$f":"$D$6","v":"Forårsvelsignelse - Weizenbock"}]
[]
[]
[null,null,null,"Brygget:",{"$f":"IF(BrewReport!K3=\"\",\"\",BrewReport!K3)","v":"2017-04-17"},null,"Tappet:",{"$f":"IF(BrewReport!D51=\"\",\"\",BrewReport!D51)","v":""},"Bryg #",{"$f":"IF(BrewReport!D3=\"\",\"\",BrewReport!D3)","v":29},null,null,null,null,null,"Brygget:",{"$f":"$E$9","v":"2017-04-17"},null,"Tappet:",{"$f":"$H$9","v":""},{"$f":"$I$9","v":"Bryg #"},{"$f":"$J$9","v":29}]
[]
[null,null,null,"Malt:",{"$f":"CONCATENATE(IF(BrewReport!A9=\"\",\"\",BrewReport!A9),IF(BrewReport!A10=\"\",\"\",CONCATENATE(\", \",BrewReport!A10)),IF(BrewReport!A11=\"\",\"\",CONCATENATE(\", \",BrewReport!A11)),IF(BrewReport!A12=\"\",\"\",CONCATENATE(\", \",BrewReport!A12)),IF(BrewReport!A13=\"\",\"\",CONCATENATE(\", \",BrewReport!A13)),IF(BrewReport!A14=\"\",\"\",CONCATENATE(\", \",BrewReport!A14)),IF(BrewReport!A15=\"\",\"\",CONCATENATE(\", \",BrewReport!A15)))","v":"Pale Ale, Wheat, Wheat Flaked"},null,null,null,null,null,null,null,null,null,null,{"$f":"$D$11","v":"Malt:"},{"$f":"$E$11","v":"Pale Ale, Wheat, Wheat Flaked"}]
[]
[null,null,null,"Humle:",{"$f":"CONCATENATE(IF(BrewReport!A23=\"\",\"\",BrewReport!A23),IF(BrewReport!A24=\"\",\"\",CONCATENATE(\", \",BrewReport!A24)),IF(BrewReport!A25=\"\",\"\",CONCATENATE(\", \",BrewReport!A25)),IF(BrewReport!A27=\"\",\"\",CONCATENATE(\", \",BrewReport!A27)),IF(BrewReport!A28=\"\",\"\",CONCATENATE(\", \",BrewReport!A28)),IF(BrewReport!A29=\"\",\"\",CONCATENATE(\", \",BrewReport!A29)),IF(BrewReport!A31=\"\",\"\",CONCATENATE(\", \",BrewReport!A31)),IF(BrewReport!A32=\"\",\"\",CONCATENATE(\", \",BrewReport!A32)),IF(BrewReport!A33=\"\",\"\",CONCATENATE(\", \",BrewReport!A33)))","v":"Perle, Perle"},null,null,null,null,null,null,null,null,null,null,{"$f":"$D$13","v":"Humle:"},{"$f":"$E$13","v":"Perle, Perle"}]
[null,null,null,null,{"$f":"CONCATENATE(IF(BrewReport!J50=\"\",\"\",IF(BrewReport!J51=\"\",BrewReport!J50,CONCATENATE(BrewReport!J50,\", \",CHAR(10)))),IF(BrewReport!J51=\"\",\"\",BrewReport!J51))","v":"Brewolution Wheat Beer"},null,null,null,null,null,null,null,null,null,null,null,{"$f":"$E$14","v":"Brewolution Wheat Beer"}]
[null,null,null,"Gær:",null,null,null,null,null,null,null,null,null,null,null,{"$f":"$D$15","v":"Gær:"}]
[]
[null,null,null,"Tilsætning:",{"$f":"CONCATENATE(IF(BrewReport!A36=\"\",\"\",BrewReport!A36),IF(BrewReport!A37=\"\",\"\",CONCATENATE(\", \",BrewReport!A37)),IF(BrewReport!A38=\"\",\"\",CONCATENATE(\", \",BrewReport!A38)),IF(BrewReport!A39=\"\",\"\",CONCATENATE(\", \",BrewReport!A39)),IF(BrewReport!A40=\"\",\"\",CONCATENATE(\", \",BrewReport!A40)),IF(OR((BrewReport!A41=\"Klar Urt\"),(BrewReport!A41=\"\")),\"\",CONCATENATE(\", \",BrewReport!A41)),IF(BrewReport!A35=\"\",\"\",CONCATENATE(\", \",BrewReport!A35)))","v":"Rørsukker, Appelsinskal"},null,null,null,null,null,null,null,null,null,null,{"$f":"$D$17","v":"Tilsætning:"},{"$f":"$E$17","v":"Rørsukker, Appelsinskal"}]
[]
[null,null,null,"Alc. Vol.:",{"$f":"IF(BrewReport!$D$54=\"\",IF(Data!I29=\"\",\"\",Data!I29/100),BrewReport!$D$54/100)","v":9.6999999999999989E-2},null,"EBC:",{"$f":"BrewReport!$E$6","v":9.9},"IBU:",{"$f":"BrewReport!$J$6","v":12.367999999999999},null,null,null,null,null,{"$f":"$D$19","v":"Alc. Vol.:"},{"$f":"$E$19","v":9.6999999999999989E-2},null,{"$f":"$G$19","v":"EBC:"},{"$f":"$H$19","v":9.9},{"$f":"$I$19","v":"IBU:"},{"$f":"$J$19","v":12.367999999999999}]
[]
[null,null,null,"Brygget af:",{"$f":"IF(BrewReport!B81=\"\",\"\",BrewReport!B81)","v":"Pierre & Lasse"},null,{"$f":"IF(Data!I36=\"\",\"\",CONCATENATE(\"Indhold: \",Data!E6,\" liter; svarer til \",IF(Data!I37=\"\",Data!I36,Data!I37),\" genstande\"))","v":"Indhold: 0,5 liter; svarer til 3,2 genstande"},null,null,null,null,null,null,null,null,{"$f":"$D$21","v":"Brygget af:"},{"$f":"$E$21","v":"Pierre & Lasse"},null,{"$f":"$G$21","v":"Indhold: 0,5 liter; svarer til 3,2 genstande"}]
[]
[null,null,null,{"$f":"IF(BrewReport!D1=\"\",\"\",BrewReport!D1)","v":"Hulebækkens bryghus"},null,null,null,null,null,null,null,null,null,null,null,{"$f":"$D$23","v":"Hulebækkens bryghus"}]
[]
[]
[]
[]
[]
[null,null,null,{"$f":"$D$6","v":"Forårsvelsignelse - Weizenbock"},null,null,null,null,null,null,null,null,null,null,null,{"$f":"$D$6","v":"Forårsvelsignelse - Weizenbock"}]
[]
[]
[null,null,null,"Brygget:",{"$f":"$E$9","v":"2017-04-17"},null,"Tappet:",{"$f":"$H$9","v":""},{"$f":"$I$9","v":"Bryg #"},{"$f":"$J$9","v":29},null,null,null,null,null,"Brygget:",{"$f":"$E$9","v":"2017-04-17"},null,"Tappet:",{"$f":"$H$9","v":""},{"$f":"$I$9","v":"Bryg #"},{"$f":"$J$9","v":29}]
[]
[null,null,null,{"$f":"$D$11","v":"Malt:"},{"$f":"$E$11","v":"Pale Ale, Wheat, Wheat Flaked"},null,null,null,null,null,null,null,null,null,null,{"$f":"$D$11","v":"Malt:"},{"$f":"$E$11","v":"Pale Ale, Wheat, Wheat Flaked"}]
[]
[null,null,null,{"$f":"$D$13","v":"Humle:"},{"$f":"$E$13","v":"Perle, Perle"},null,null,null,null,null,null,null,null,null,null,{"$f":"$D$13","v":"Humle:"},{"$f":"$E$13","v":"Perle, Perle"}]
[null,null,null,null,{"$f":"$E$14","v":"Brewolution Wheat Beer"},null,null,null,null,null,null,null,null,null,null,null,{"$f":"$E$14","v":"Brewolution Wheat Beer"}]
[null,null,null,{"$f":"$D$15","v":"Gær:"},null,null,null,null,null,null,null,null,null,null,null,{"$f":"$D$15","v":"Gær:"}]
[]
[null,null,null,{"$f":"$D$17","v":"Tilsætning:"},{"$f":"$E$17","v":"Rørsukker, Appelsinskal"},null,null,null,null,null,null,null,null,null,null,{"$f":"$D$17","v":"Tilsætning:"},{"$f":"$E$17","v":"Rørsukker, Appelsinskal"}]
[]
[null,null,null,{"$f":"$D$19","v":"Alc. Vol.:"},{"$f":"$E$19","v":9.6999999999999989E-2},null,{"$f":"$G$19","v":"EBC:"},{"$f":"$H$19","v":9.9},{"$f":"$I$19","v":"IBU:"},{"$f":"$J$19","v":12.367999999999999},null,null,null,null,null,{"$f":"$D$19","v":"Alc. Vol.:"},{"$f":"$E$19","v":9.6999999999999989E-2},null,{"$f":"$G$19","v":"EBC:"},{"$f":"$H$19","v":9.9},{"$f":"$I$19","v":"IBU:"},{"$f":"$J$19","v":12.367999999999999}]
[]
[null,null,null,{"$f":"$D$21","v":"Brygget af:"},{"$f":"$E$21","v":"Pierre & Lasse"},null,{"$f":"$G$21","v":"Indhold: 0,5 liter; svarer til 3,2 genstande"},null,null,null,null,null,null,null,null,{"$f":"$D$21","v":"Brygget af:"},{"$f":"$E$21","v":"Pierre & Lasse"},null,{"$f":"$G$21","v":"Indhold: 0,5 liter; svarer til 3,2 genstande"}]
[]
[null,null,null,{"$f":"$D$23","v":"Hulebækkens bryghus"},null,null,null,null,null,null,null,null,null,null,null,{"$f":"$D$23","v":"Hulebækkens bryghus"}]
[]
[]
[]
[]
[]
[null,null,null,{"$f":"$D$6","v":"Forårsvelsignelse - Weizenbock"},null,null,null,null,null,null,null,null,null,null,null,{"$f":"$D$6","v":"Forårsvelsignelse - Weizenbock"}]
[]
[]
[null,null,null,"Brygget:",{"$f":"$E$9","v":"2017-04-17"},null,"Tappet:",{"$f":"$H$9","v":""},{"$f":"$I$9","v":"Bryg #"},{"$f":"$J$9","v":29},null,null,null,null,null,"Brygget:",{"$f":"$E$9","v":"2017-04-17"},null,"Tappet:",{"$f":"$H$9","v":""},{"$f":"$I$9","v":"Bryg #"},{"$f":"$J$9","v":29}]
[]
[null,null,null,{"$f":"$D$11","v":"Malt:"},{"$f":"$E$11","v":"Pale Ale, Wheat, Wheat Flaked"},null,null,null,null,null,null,null,null,null,null,{"$f":"$D$11","v":"Malt:"},{"$f":"$E$11","v":"Pale Ale, Wheat, Wheat Flaked"}]
[]
[null,null,null,{"$f":"$D$13","v":"Humle:"},{"$f":"$E$13","v":"Perle, Perle"},null,null,null,null,null,null,null,null,null,null,{"$f":"$D$13","v":"Humle:"},{"$f":"$E$13","v":"Perle, Perle"}]
[null,null,null,null,{"$f":"$E$14","v":"Brewolution Wheat Beer"},null,null,null,null,null,null,null,null,null,null,null,{"$f":"$E$14","v":"Brewolution Wheat Beer"}]
[null,null,null,{"$f":"$D$15","v":"Gær:"},null,null,null,null,null,null,null,null,null,null,null,{"$f":"$D$15","v":"Gær:"}]
[]
[null,null,null,{"$f":"$D$17","v":"Tilsætning:"},{"$f":"$E$17","v":"Rørsukker, Appelsinskal"},null,null,null,null,null,null,null,null,null,null,{"$f":"$D$17","v":"Tilsætning:"},{"$f":"$E$17","v":"Rørsukker, Appelsinskal"}]
[]
[null,null,null,{"$f":"$D$19","v":"Alc. Vol.:"},{"$f":"$E$19","v":9.6999999999999989E-2},null,{"$f":"$G$19","v":"EBC:"},{"$f":"$H$19","v":9.9},{"$f":"$I$19","v":"IBU:"},{"$f":"$J$19","v":12.367999999999999},null,null,null,null,null,{"$f":"$D$19","v":"Alc. Vol.:"},{"$f":"$E$19","v":9.6999999999999989E-2},null,{"$f":"$G$19","v":"EBC:"},{"$f":"$H$19","v":9.9},{"$f":"$I$19","v":"IBU:"},{"$f":"$J$19","v":12.367999999999999}]
[]
[null,null,null,{"$f":"$D$21","v":"Brygget af:"},{"$f":"$E$21","v":"Pierre & Lasse"},null,{"$f":"$G$21","v":"Indhold: 0,5 liter; svarer til 3,2 genstande"},null,null,null,null,null,null,null,null,{"$f":"$D$21","v":"Brygget af:"},{"$f":"$E$21","v":"Pierre & Lasse"},null,{"$f":"$G$21","v":"Indhold: 0,5 liter; svarer til 3,2 genstande"}]
[]
[null,null,null,{"$f":"$D$23","v":"Hulebækkens bryghus"},null,null,null,null,null,null,null,null,null,null,null,{"$f":"$D$23","v":"Hulebækkens bryghus"}]
[]
[]
[]
[]
[]
[null,null,null,{"$f":"$D$6","v":"Forårsvelsignelse - Weizenbock"},null,null,null,null,null,null,null,null,null,null,null,{"$f":"$D$6","v":"Forårsvelsignelse - Weizenbock"}]
[]
[]
[null,null,null,"Brygget:",{"$f":"$E$9","v":"2017-04-17"},null,"Tappet:",{"$f":"$H$9","v":""},{"$f":"$I$9","v":"Bryg #"},{"$f":"$J$9","v":29},null,null,null,null,null,"Brygget:",{"$f":"$E$9","v":"2017-04-17"},null,"Tappet:",{"$f":"$H$9","v":""},{"$f":"$I$9","v":"Bryg #"},{"$f":"$J$9","v":29}]
[]
[null,null,null,{"$f":"$D$11","v":"Malt:"},{"$f":"$E$11","v":"Pale Ale, Wheat, Wheat Flaked"},null,null,null,null,null,null,null,null,null,null,{"$f":"$D$11","v":"Malt:"},{"$f":"$E$11","v":"Pale Ale, Wheat, Wheat Flaked"}]
[]
[null,null,null,{"$f":"$D$13","v":"Humle:"},{"$f":"$E$13","v":"Perle, Perle"},null,null,null,null,null,null,null,null,null,null,{"$f":"$D$13","v":"Humle:"},{"$f":"$E$13","v":"Perle, Perle"}]
[null,null,null,null,{"$f":"$E$14","v":"Brewolution Wheat Beer"},null,null,null,null,null,null,null,null,null,null,null,{"$f":"$E$14","v":"Brewolution Wheat Beer"}]
[null,null,null,{"$f":"$D$15","v":"Gær:"},null,null,null,null,null,null,null,null,null,null,null,{"$f":"$D$15","v":"Gær:"}]
[]
[null,null,null,{"$f":"$D$17","v":"Tilsætning:"},{"$f":"$E$17","v":"Rørsukker, Appelsinskal"},null,null,null,null,null,null,null,null,null,null,{"$f":"$D$17","v":"Tilsætning:"},{"$f":"$E$17","v":"Rørsukker, Appelsinskal"}]
[]
[null,null,null,{"$f":"$D$19","v":"Alc. Vol.:"},{"$f":"$E$19","v":9.6999999999999989E-2},null,{"$f":"$G$19","v":"EBC:"},{"$f":"$H$19","v":9.9},{"$f":"$I$19","v":"IBU:"},{"$f":"$J$19","v":12.367999999999999},null,null,null,null,null,{"$f":"$D$19","v":"Alc. Vol.:"},{"$f":"$E$19","v":9.6999999999999989E-2},null,{"$f":"$G$19","v":"EBC:"},{"$f":"$H$19","v":9.9},{"$f":"$I$19","v":"IBU:"},{"$f":"$J$19","v":12.367999999999999}]
[]
[null,null,null,{"$f":"$D$21","v":"Brygget af:"},{"$f":"$E$21","v":"Pierre & Lasse"},null,{"$f":"$G$21","v":"Indhold: 0,5 liter; svarer til 3,2 genstande"},null,null,null,null,null,null,null,null,{"$f":"$D$21","v":"Brygget af:"},{"$f":"$E$21","v":"Pierre & Lasse"},null,{"$f":"$G$21","v":"Indhold: 0,5 liter; svarer til 3,2 genstande"}]
[]
[null,null,null,{"$f":"$D$23","v":"Hulebækkens bryghus"},null,null,null,null,null,null,null,null,null,null,null,{"$f":"$D$23","v":"Hulebækkens bryghus"}]

{"sheet":"Data","index":3,"n_rows":333,"n_cols":16,"rows_kept":333,"cut":false,"hidden":false,"merged":[[56,4,56,8],[29,3,29,4],[31,10,32,10],[30,10,30,13],[23,11,23,13],[31,13,32,13],[31,12,32,12],[31,11,32,11],[28,11,28,13],[27,11,27,13],[26,11,26,13],[25,11,25,13],[24,11,24,13],[31,3,31,4],[28,7,31,7],[15,11,15,13],[20,11,20,13],[19,11,19,13],[18,11,18,13],[17,11,17,13],[16,11,16,13],[21,11,21,13],[22,11,22,13],[16,3,21,3],[28,8,31,8],[73,8,73,9],[0,3,0,8],[34,7,34,8],[33,7,33,8],[54,5,54,7],[1,4,1,8],[2,4,2,8],[5,5,5,8],[4,5,4,8],[3,5,3,8],[28,3,28,4],[27,6,27,7],[18,4,18,6],[6,5,6,8],[30,3,30,4]]}
[{"$f":"IF(BrewReport!J10>0,BrewReport!J10,\"\")","v":10},{"$f":"IF(BrewReport!L10>0,BrewReport!L10,\"\")","v":45},null,"STAMDATA"]
[{"$f":"IF(BrewReport!J12>0,BrewReport!J12,\"\")","v":10},{"$f":"IF(BrewReport!L12>0,BrewReport!L12,\"\")","v":57},null,"Bryggeri"]
[{"$f":"IF(BrewReport!J13>0,BrewReport!J13,\"\")","v":30},{"$f":"IF(BrewReport!L13>0,BrewReport!L13,\"\")","v":62},null,"Brygmester"]
[{"$f":"IF(BrewReport!J14>0,BrewReport!J14,\"\")","v":""},{"$f":"IF(BrewReport!L14>0,BrewReport!L14,\"\")","v":""},null,"Mæskeeffektivitet",0.75,"Anvendes til at estimere Original Gravity"]
[{"$f":"IF(BrewReport!J15>0,BrewReport!J15,\"\")","v":""},{"$f":"IF(BrewReport!L15>0,BrewReport!L15,\"\")","v":""},null,"Urtmængde i liter",25,"Anvendes til at beregne Effektivitet og Original Gravity"]
[{"$f":"IF(BrewReport!J16>0,BrewReport!J16,\"\")","v":30},{"$f":"IF(BrewReport!L16>0,BrewReport!L16,\"\")","v":72},null,"Flaskestørrelse i liter",0.5,"Anvendes til at beregne og vise antal genstande"]
[{"$f":"IF(BrewReport!J17>0,BrewReport!J17,\"\")","v":5},{"$f":"IF(BrewReport!L17>0,BrewReport!L17,\"\")","v":78},null,"Opvarmningstid af urt (min/°C)",1,"Anvendes til at beregne bryggetider"]
[{"$f":"IF(BrewReport!J18>0,BrewReport!J18,\"\")","v":""},{"$f":"IF(BrewReport!L18>0,BrewReport!L18,\"\")","v":""},null,"Beregninger","Malt","%","EBC","Ekstraktudbytte","OG"]
[{"$f":"IF(BrewReport!J19>0,BrewReport!J19,\"\")","v":1},{"$f":"IF(BrewReport!L19>0,BrewReport!L19,\"\")","v":78},null,null,{"$f":"IF(BrewReport!A9=\"\",\"\",BrewReport!A9)","v":"Pale Ale"},{"$f":"IF(E9=\"\",\"\",ROUND(((BrewReport!D9/BrewReport!$D$19)*100),1))","v":50},{"$f":"IF(E9=\"\",\"\",IF(BrewReport!D9=\"\",\"\",ROUND((VLOOKUP(E9,Malt!$A$3:$D$75,3,)*(Data!F9/100)),1)))","v":4},{"$f":"IF(E9=\"\",\"\",(VLOOKUP(E9,Malt!$A$2:$D$75,4,)*F9/100))","v":150},"|"]
[{"$f":"IF(BrewReport!J22>0,BrewReport!J22,\"\")","v":90},{"$f":"IF(BrewReport!J22>0,100,\"\")","v":100},null,null,{"$f":"IF(BrewReport!A10=\"\",\"\",BrewReport!A10)","v":"Wheat"},{"$f":"IF(E10=\"\",\"\",ROUND(((BrewReport!D10/BrewReport!$D$19)*100),1))","v":41.7},{"$f":"IF(E10=\"\",\"\",IF(BrewReport!D10=\"\",\"\",ROUND((VLOOKUP(E10,Malt!$A$3:$D$75,3,)*(Data!F10/100)),1)))","v":1.3},{"$f":"IF(E10=\"\",\"\",(VLOOKUP(E10,Malt!$A$2:$D$75,4,)*F10/100))","v":129.27000000000001},"|"]
[{"$f":"IFERROR(INDEX($A$1:$A$10,SMALL(IF(ISNUMBER($A$1:$A$10),ROW($A$1:$A$10)),ROW(A1))),\"\")","v":10},{"$f":"IFERROR(INDEX($B$1:$B$10,SMALL(IF(ISNUMBER($B$1:$B$10),ROW($B$1:$B$10)),ROW(B1))),\"\")","v":45},{"$f":"IF(A11=\"\",\"\",A11)","v":10},null,{"$f":"IF(BrewReport!A11=\"\",\"\",BrewReport!A11)","v":"Wheat Flaked"},{"$f":"IF(E11=\"\",\"\",ROUND(((BrewReport!D11/BrewReport!$D$19)*100),1))","v":8.3000000000000007},{"$f":"IF(E11=\"\",\"\",IF(BrewReport!D11=\"\",\"\",ROUND((VLOOKUP(E11,Malt!$A$3:$D$75,3,)*(Data!F11/100)),1)))","v":0.4},{"$f":"IF(E11=\"\",\"\",(VLOOKUP(E11,Malt!$A$2:$D$75,4,)*F11/100))","v":24.07},"|"]
[{"$f":"IFERROR(INDEX($A$1:$A$10,SMALL(IF(ISNUMBER($A$1:$A$10),ROW($A$1:$A$10)),ROW(A2))),\"\")","v":10},{"$f":"IFERROR(INDEX($B$1:$B$10,SMALL(IF(ISNUMBER($B$1:$B$10),ROW($B$1:$B$10)),ROW(B2))),\"\")","v":57},{"$f":"IF(A12=\"\",\"\",A12+C11)","v":20},null,{"$f":"IF(BrewReport!A12=\"\",\"\",BrewReport!A12)","v":""},{"$f":"IF(E12=\"\",\"\",ROUND(((BrewReport!D12/BrewReport!$D$19)*100),1))","v":""},{"$f":"IF(E12=\"\",\"\",IF(BrewReport!D12=\"\",\"\",ROUND((VLOOKUP(E12,Malt!$A$3:$D$75,3,)*(Data!F12/100)),1)))","v":""},{"$f":"IF(E12=\"\",\"\",(VLOOKUP(E12,Malt!$A$2:$D$75,4,)*F12/100))","v":""},"|"]
[{"$f":"IFERROR(INDEX($A$1:$A$10,SMALL(IF(ISNUMBER($A$1:$A$10),ROW($A$1:$A$10)),ROW(A3))),\"\")","v":30},{"$f":"IFERROR(INDEX($B$1:$B$10,SMALL(IF(ISNUMBER($B$1:$B$10),ROW($B$1:$B$10)),ROW(B3))),\"\")","v":62},{"$f":"IF(A13=\"\",\"\",A13+C12)","v":50},null,{"$f":"IF(BrewReport!A13=\"\",\"\",BrewReport!A13)","v":""},{"$f":"IF(E13=\"\",\"\",ROUND(((BrewReport!D13/BrewReport!$D$19)*100),1))","v":""},{"$f":"IF(E13=\"\",\"\",IF(BrewReport!D13=\"\",\"\",ROUND((VLOOKUP(E13,Malt!$A$3:$D$75,3,)*(Data!F13/100)),1)))","v":""},{"$f":"IF(E13=\"\",\"\",(VLOOKUP(E13,Malt!$A$2:$D$75,4,)*F13/100))","v":""},"|"]
[{"$f":"IFERROR(INDEX($A$1:$A$10,SMALL(IF(ISNUMBER($A$1:$A$10),ROW($A$1:$A$10)),ROW(A4))),\"\")","v":30},{"$f":"IFERROR(INDEX($B$1:$B$10,SMALL(IF(ISNUMBER($B$1:$B$10),ROW($B$1:$B$10)),ROW(B4))),\"\")","v":72},80,"Estimeret effektivitet",{"$f":"IF(BrewReport!A14=\"\",\"\",BrewReport!A14)","v":""},{"$f":"IF(E14=\"\",\"\",ROUND(((BrewReport!D14/BrewReport!$D$19)*100),1))","v":""},{"$f":"IF(E14=\"\",\"\",IF(BrewReport!D14=\"\",\"\",ROUND((VLOOKUP(E14,Malt!$A$3:$D$75,3,)*(Data!F14/100)),1)))","v":""},{"$f":"IF(E14=\"\",\"\",(VLOOKUP(E14,Malt!$A$2:$D$75,4,)*F14/100))","v":""},"|"]
[{"$f":"IFERROR(INDEX($A$1:$A$10,SMALL(IF(ISNUMBER($A$1:$A$10),ROW($A$1:$A$10)),ROW(A5))),\"\")","v":5},{"$f":"IFERROR(INDEX($B$1:$B$10,SMALL(IF(ISNUMBER($B$1:$B$10),ROW($B$1:$B$10)),ROW(B5))),\"\")","v":78},85,{"$f":"IF(BrewReport!D19=0,\"\",((I26-1000)*E5)/(BrewReport!D19*H26))","v":0.74763435100874853},{"$f":"IF(BrewReport!A15=\"\",\"\",BrewReport!A15)","v":""},{"$f":"IF(E15=\"\",\"\",ROUND(((BrewReport!D15/BrewReport!$D$19)*100),1))","v":""},{"$f":"IF(E15=\"\",\"\",IF(BrewReport!D15=\"\",\"\",ROUND((VLOOKUP(E15,Malt!$A$3:$D$75,3,)*(Data!F15/100)),1)))","v":""},{"$f":"IF(E15=\"\",\"\",(VLOOKUP(E15,Malt!$A$2:$D$75,4,)*F15/100))","v":""},"|"]
[{"$f":"IFERROR(INDEX($A$1:$A$10,SMALL(IF(ISNUMBER($A$1:$A$10),ROW($A$1:$A$10)),ROW(A6))),\"\")","v":1},{"$f":"IFERROR(INDEX($B$1:$B$10,SMALL(IF(ISNUMBER($B$1:$B$10),ROW($B$1:$B$10)),ROW(B6))),\"\")","v":78},86,null,{"$f":"IF(BrewReport!A16=\"\",\"\",BrewReport!A16)","v":""},{"$f":"IF(E16=\"\",\"\",ROUND(((BrewReport!D16/BrewReport!$D$19)*100),1))","v":""},{"$f":"IF(E16=\"\",\"\",IF(BrewReport!D16=\"\",\"\",ROUND((VLOOKUP(E16,Malt!$A$3:$D$75,3,)*(Data!F16/100)),1)))","v":""},{"$f":"IF(E16=\"\",\"\",(VLOOKUP(E16,Malt!$A$2:$D$75,4,)*F16/100))","v":""},"|",null,"EBC","Example",null,null,"Beer color","SRM"]
[{"$f":"IFERROR(INDEX($A$1:$A$10,SMALL(IF(ISNUMBER($A$1:$A$10),ROW($A$1:$A$10)),ROW(A7))),\"\")","v":90},{"$f":"IFERROR(INDEX($B$1:$B$10,SMALL(IF(ISNUMBER($B$1:$B$10),ROW($B$1:$B$10)),ROW(B7))),\"\")","v":100},176,null,{"$f":"IF(BrewReport!A17=\"\",\"\",BrewReport!A17)","v":""},{"$f":"IF(E17=\"\",\"\",ROUND(((BrewReport!D17/BrewReport!$D$19)*100),1))","v":""},{"$f":"IF(E17=\"\",\"\",IF(BrewReport!D17=\"\",\"\",ROUND((VLOOKUP(E17,Malt!$A$3:$D$75,3,)*(Data!F17/100)),1)))","v":""},{"$f":"IF(E17=\"\",\"\",(VLOOKUP(E17,Malt!$A$2:$D$75,4,)*F17/100))","v":""},"|",null,4,"Pale lager, Witbier, Pilsener, Berliner Weisse",null,null,null,2]
[{"$f":"IFERROR(INDEX($A$1:$A$10,SMALL(IF(ISNUMBER($A$1:$A$10),ROW($A$1:$A$10)),ROW(A8))),\"\")","v":""},{"$f":"IFERROR(INDEX($B$1:$B$10,SMALL(IF(ISNUMBER($B$1:$B$10),ROW($B$1:$B$10)),ROW(B8))),\"\")","v":""},"",null,{"$f":"IF(BrewReport!A18=\"\",\"\",BrewReport!A18)","v":""},{"$f":"IF(E18=\"\",\"\",ROUND(((BrewReport!D18/BrewReport!$D$19)*100),1))","v":""},{"$f":"IF(E18=\"\",\"\",IF(BrewReport!D18=\"\",\"\",ROUND((VLOOKUP(E18,Malt!$A$3:$D$75,3,)*(Data!F18/100)),1)))","v":""},{"$f":"IF(E18=\"\",\"\",(VLOOKUP(E18,Malt!$A$2:$D$75,4,)*F18/100))","v":""},"|",null,6,"Maibock, Blonde Ale",null,null,null,3]
[{"$f":"IFERROR(INDEX($A$1:$A$10,SMALL(IF(ISNUMBER($A$1:$A$10),ROW($A$1:$A$10)),ROW(A9))),\"\")","v":""},{"$f":"IFERROR(INDEX($B$1:$B$10,SMALL(IF(ISNUMBER($B$1:$B$10),ROW($B$1:$B$10)),ROW(B9))),\"\")","v":""},"",null,"Maltudbytte i alt",null,null,{"$f":"ROUND(SUM(H9:H18),1)","v":303.3},"|",null,8,"Weissbier",null,null,null,4]
[{"$f":"IFERROR(INDEX($A$1:$A$10,SMALL(IF(ISNUMBER($A$1:$A$10),ROW($A$1:$A$10)),ROW(A10))),\"\")","v":""},{"$f":"IFERROR(INDEX($B$1:$B$10,SMALL(IF(ISNUMBER($B$1:$B$10),ROW($B$1:$B$10)),ROW(B10))),\"\")","v":""},"",null,{"$f":"IF(OR((BrewReport!A36=\"Klar Urt\"),(BrewReport!A36=\"Appelsinskal\"),(BrewReport!A36=\"Koriander\"),(BrewReport!A36=\"\")),\"\",BrewReport!A36)","v":"Rørsukker"},{"$f":"IF(E20=\"\",\"\",ROUND((((BrewReport!D36/1000)/BrewReport!$D$19)*100),1))","v":16.7},{"$f":"IF(E20=\"\",\"\",IF(BrewReport!D36=\"\",\"\",ROUND((VLOOKUP(E20,Tilsætninger!$A$2:$D$24,3,)*(Data!F20/100)),1)))","v":4.2},{"$f":"IF(E20=\"\",\"\",(VLOOKUP(E20,Tilsætninger!$A$2:$D$24,4,)*F20/100))","v":70.14},"|",null,12,"American Pale Ale, India Pale Ale",null,null,null,6]
[0,{"$f":"IF(A21<=$C$11,$B$11,IF(A21<=$C$12,$B$12,IF(A21<=$C$13,$B$13,IF(A21<=$C$14,$B$14,IF(A21<=$C$15,$B$15,IF(A21<=$C$16,$B$16,IF(A21<=$C$17,$B$17,IF(A21<=$C$18,$B$18,IF(A21<=$C$19,$B$19,IF(A21<=$C$20,$B$20,\"\"))))))))))","v":45},null,null,{"$f":"IF(OR((BrewReport!A37=\"Klar Urt\"),(BrewReport!A37=\"Appelsinskal\"),(BrewReport!A37=\"Koriander\"),(BrewReport!A37=\"\")),\"\",BrewReport!A37)","v":""},{"$f":"IF(E21=\"\",\"\",ROUND((((BrewReport!D37/1000)/BrewReport!$D$19)*100),1))","v":""},{"$f":"IF(E21=\"\",\"\",IF(BrewReport!D37=\"\",\"\",ROUND((VLOOKUP(E21,Tilsætninger!$A$2:$D$24,3,)*(Data!F21/100)),1)))","v":""},{"$f":"IF(E21=\"\",\"\",(VLOOKUP(E21,Tilsætninger!$A$2:$D$24,4,)*F21/100))","v":""},"|",null,16,"Weissbier, Saison",null,null,null,8]
[5,{"$f":"IF(A22<=$C$11,$B$11,IF(A22<=$C$12,$B$12,IF(A22<=$C$13,$B$13,IF(A22<=$C$14,$B$14,IF(A22<=$C$15,$B$15,IF(A22<=$C$16,$B$16,IF(A22<=$C$17,$B$17,IF(A22<=$C$18,$B$18,IF(A22<=$C$19,$B$19,IF(A22<=$C$20,$B$20,\"\"))))))))))","v":45},null,null,{"$f":"IF(OR((BrewReport!A38=\"Klar Urt\"),(BrewReport!A38=\"Appelsinskal\"),(BrewReport!A38=\"Koriander\"),(BrewReport!A38=\"\")),\"\",BrewReport!A38)","v":""},{"$f":"IF(E22=\"\",\"\",ROUND((((BrewReport!D38/1000)/BrewReport!$D$19)*100),1))","v":""},{"$f":"IF(E22=\"\",\"\",IF(BrewReport!D38=\"\",\"\",ROUND((VLOOKUP(E22,Tilsætninger!$A$2:$D$24,3,)*(Data!F22/100)),1)))","v":""},{"$f":"IF(E22=\"\",\"\",(VLOOKUP(E22,Tilsætninger!$A$2:$D$24,4,)*F22/100))","v":""},"|",null,20,"English Bitter, ESB",null,null,null,10]
[10,45,null,"Faktisk effektivitet",{"$f":"IF(OR((BrewReport!A39=\"Klar Urt\"),(BrewReport!A39=\"Appelsinskal\"),(BrewReport!A39=\"Koriander\"),(BrewReport!A39=\"\")),\"\",BrewReport!A39)","v":""},{"$f":"IF(E23=\"\",\"\",ROUND((((BrewReport!D39/1000)/BrewReport!$D$19)*100),1))","v":""},{"$f":"IF(E23=\"\",\"\",IF(BrewReport!D39=\"\",\"\",ROUND((VLOOKUP(E23,Tilsætninger!$A$2:$D$24,3,)*(Data!F23/100)),1)))","v":""},{"$f":"IF(E23=\"\",\"\",(VLOOKUP(E23,Tilsætninger!$A$2:$D$24,4,)*F23/100))","v":""},"|",null,26,"Biere de Garde, Double IPA",null,null,null,13]
[15,57,null,{"$f":"IF(BrewReport!$D$19=0,\"\",((BrewReport!$D$49-1000)*BrewReport!$D$45)/(BrewReport!$D$19*$H$19))","v":0.72040883613583906},{"$f":"IF(OR((BrewReport!A40=\"Klar Urt\"),(BrewReport!A40=\"Appelsinskal\"),(BrewReport!A40=\"Koriander\"),(BrewReport!A40=\"\")),\"\",BrewReport!A40)","v":""},{"$f":"IF(E24=\"\",\"\",ROUND((((BrewReport!D40/1000)/BrewReport!$D$19)*100),1))","v":""},{"$f":"IF(E24=\"\",\"\",IF(BrewReport!D40=\"\",\"\",ROUND((VLOOKUP(E24,Tilsætninger!$A$2:$D$24,3,)*(Data!F24/100)),1)))","v":""},{"$f":"IF(E24=\"\",\"\",(VLOOKUP(E24,Tilsætninger!$A$2:$D$24,4,)*F24/100))","v":""},"|",null,33,"Dark lager, Vienna lager, Marzen, Amber Ale",null,null,null,17]
[20,57,null,{"$f":"IF(BrewReport!$D$19=0,\"\",((BrewReport!$D$50-1000)*BrewReport!$D$46)/(BrewReport!$D$19*$H$26))","v":0.68291376539903603},{"$f":"IF(OR((BrewReport!A41=\"Klar Urt\"),(BrewReport!A41=\"Appelsinskal\"),(BrewReport!A41=\"Koriander\"),(BrewReport!A41=\"\")),\"\",BrewReport!A41)","v":""},{"$f":"IF(E25=\"\",\"\",ROUND((((BrewReport!D41/1000)/BrewReport!$D$19)*100),1))","v":""},{"$f":"IF(E25=\"\",\"\",IF(BrewReport!D41=\"\",\"\",ROUND((VLOOKUP(E25,Tilsætninger!$A$2:$D$24,3,)*(Data!F25/100)),1)))","v":""},{"$f":"IF(E25=\"\",\"\",(VLOOKUP(E25,Tilsætninger!$A$2:$D$24,4,)*F25/100))","v":""},"|",null,39,"Brown Ale, Bock, Dunkel, Dunkelweizen",null,null,null,20]
[25,62,null,null,null,{"$f":"ROUND(SUM(F9:F14),0)","v":100},{"$f":"ROUND(SUM(G9:G25),1)","v":9.9},{"$f":"ROUND(SUM(H19:H25),1)","v":373.4},{"$f":"ROUND(((BrewReport!D19*H26*(E4))/E5),0)+1000","v":1067},null,47,"Irish Dry Stout, Doppelbock, Porter",null,null,null,24]
[30,62,null,"Gær navn og nummer",null,"Alc.Tol.","Att. %","FG:","ALC.%",null,57,"Stout",null,null,null,29]
[35,62,null,null,null,null,"FG beregnet af højeste Att.%",null,null,null,69,"Foreign Stout, Baltic Porter",null,null,null,35]
[40,62,null,{"$f":"IF(BrewReport!J50=\"\",\"\",BrewReport!J50)","v":"Brewolution Wheat Beer"},null,{"$f":"IF(D29=\"\",\"\",(VLOOKUP(D29,Gær!A2:G70,7,FALSE)))","v":7.5},{"$f":"IF(D29=\"\",\"\",(VLOOKUP(D29,Gær!A2:G70,5,FALSE)))","v":73},{"$f":"IF(SUM(G29:G33)=0,\"\",ROUND((I26-((I26-1000)*(MAX(G29:G32)/100))),0))","v":1018},{"$f":"IF(H29=\"\",\"\",((I26-H29)/7.5))","v":6.5333333333333332},null,79,"Imperial Stout",null,null,null,"40+"]
[45,62,null,{"$f":"IF(BrewReport!J51=\"\",\"\",BrewReport!J51)","v":""},null,{"$f":"IF(D30=\"\",\"\",(VLOOKUP(D30,Gær!A2:G70,7,FALSE)))","v":""},{"$f":"IF(D30=\"\",\"\",(VLOOKUP(D30,Gær!A2:G70,5,FALSE)))","v":""}]
[50,62,null,{"$f":"IF(BrewReport!J59=\"\",\"\",BrewReport!J59)","v":""},null,{"$f":"IF(D31=\"\",\"\",(VLOOKUP(D31,Gær!A2:G70,7,FALSE)))","v":""},{"$f":"IF(D31=\"\",\"\",(VLOOKUP(D31,Gær!A2:G70,5,FALSE)))","v":""},null,null,null,"This is EBC to RGB"]
[55,72,null,{"$f":"IF(BrewReport!J60=\"\",\"\",BrewReport!J60)","v":""},null,{"$f":"IF(D32=\"\",\"\",(VLOOKUP(D32,Gær!A2:G70,7,FALSE)))","v":""},{"$f":"IF(D32=\"\",\"\",(VLOOKUP(D32,Gær!A2:G70,5,FALSE)))","v":""},null,null,null,null,{"$f":"IF(G26=0,\"\",VLOOKUP(G26, K34:N333,2,TRUE))","v":225},{"$f":"IF(G26=0,\"\",VLOOKUP(G26, K34:N333,3,TRUE))","v":208},{"$f":"IF(G26=0,\"\",VLOOKUP(G26, K34:N333,4,TRUE))","v":50},null,"This is SRM to RGB"]
[60,72]
[65,72,null,null,null,null,null,"Flaskeindhold",null,null,0.2,250,250,210,null,"0,1 250 250 210"]
[70,72,null,null,null,null,null,"Svarer til i genstande:",null,null,0.4,250,250,204,null,"0,2 250 250 204"]
[75,72,null,null,null,null,null,"Estimat",{"$f":"IF(I29=\"\",\"\",ROUND((((E6*1000)*0.79*(I29/100))/12),1))","v":2.2000000000000002},null,0.6,250,250,199,null,"0,3 250 250 199"]
[80,72,null,null,null,null,null,"Brygget",{"$f":"IF(BrewReport!D54=\"\",\"\",ROUND((((E6*1000)*0.79*(BrewReport!D54/100))/12),1))","v":3.2},null,0.8,250,250,193,null,"0,4 250 250 193"]
[85,78,null,null,null,null,null,null,null,null,1,250,250,188,null,"0,5 250 250 188"]
[90,100,null,null,null,null,null,null,null,null,1.2,250,250,182,null,"0,6 250 250 182"]
[95,100,null,null,null,null,null,null,null,null,1.4,250,250,177,null,"0,7 250 250 177"]
[100,100,null,null,"Humle","Gram","IBU Avg.","Udnyttelsesgrad","IBU i urten",null,1.6,250,250,171,null,"0,8 250 250 171"]
[105,100,null,null,{"$f":"IF(BrewReport!A23=\"\",\"\",BrewReport!A23)","v":"Perle"},{"$f":"IF(BrewReport!D23=\"\",\"\",BrewReport!D23)","v":30},{"$f":"IF(E42=\"\",\"\",IF(BrewReport!B23=\"\",\"\",IF(BrewReport!B23=\"Blomst\",VLOOKUP(E42,Humle!$A$3:$J$38,4,FALSE),IF(BrewReport!B23=\"Pellet\",VLOOKUP(E42,Humle!$A$3:$J$38,5,FALSE)))))","v":4},{"$f":"IF(E42=\"\",\"\",VLOOKUP(BrewReport!$J23,Humle!$N$8:$Y$33,((ROUNDDOWN(($I$26/10),0)*10)-1000)/10-1,TRUE)*100)","v":21.099999999999998},{"$f":"IF(E42=\"\",\"\",IF(BrewReport!J23=\"\",\"\",(F42*G42*H42)/($E$5*10)))","v":10.127999999999998},null,1.8,250,250,166,null,"0,9 250 250 166"]
[110,100,null,null,{"$f":"IF(BrewReport!A24=\"\",\"\",BrewReport!A24)","v":""},{"$f":"IF(BrewReport!D24=\"\",\"\",BrewReport!D24)","v":""},{"$f":"IF(E43=\"\",\"\",IF(BrewReport!B24=\"\",\"\",IF(BrewReport!B24=\"Blomst\",VLOOKUP(E43,Humle!$A$3:$J$38,4,FALSE),IF(BrewReport!B24=\"Pellet\",VLOOKUP(E43,Humle!$A$3:$J$38,5,FALSE)))))","v":""},{"$f":"IF(E43=\"\",\"\",VLOOKUP(BrewReport!$J24,Humle!$N$8:$Y$33,((ROUNDDOWN(($I$26/10),0)*10)-1000)/10-1,TRUE)*100)","v":""},{"$f":"IF(E43=\"\",\"\",IF(BrewReport!J24=\"\",\"\",(F43*G43*H43)/($E$5*10)))","v":""},null,2,250,250,160,null,"1 250 250 160"]
[115,100,null,null,{"$f":"IF(BrewReport!A25=\"\",\"\",BrewReport!A25)","v":""},{"$f":"IF(BrewReport!D25=\"\",\"\",BrewReport!D25)","v":""},{"$f":"IF(E44=\"\",\"\",IF(BrewReport!B25=\"\",\"\",IF(BrewReport!B25=\"Blomst\",VLOOKUP(E44,Humle!$A$3:$J$38,4,FALSE),IF(BrewReport!B25=\"Pellet\",VLOOKUP(E44,Humle!$A$3:$J$38,5,FALSE)))))","v":""},{"$f":"IF(E44=\"\",\"\",VLOOKUP(BrewReport!$J25,Humle!$N$8:$Y$33,((ROUNDDOWN(($I$26/10),0)*10)-1000)/10-1,TRUE)*100)","v":""},{"$f":"IF(E44=\"\",\"\",IF(BrewReport!J25=\"\",\"\",(F44*G44*H44)/($E$5*10)))","v":""},null,2.2000000000000002,250,250,155,null,"1,1 250 250 155"]
[120,100,null,null,null,null,null,null,"-",null,2.4,250,250,149,null,"1,2 250 250 149"]
[125,100,null,null,{"$f":"IF(BrewReport!A27=\"\",\"\",BrewReport!A27)","v":""},{"$f":"IF(BrewReport!D27=\"\",\"\",BrewReport!D27)","v":""},{"$f":"IF(E46=\"\",\"\",IF(BrewReport!B27=\"\",\"\",IF(BrewReport!B27=\"Blomst\",VLOOKUP(E46,Humle!$A$3:$J$38,4,FALSE),IF(BrewReport!B27=\"Pellet\",VLOOKUP(E46,Humle!$A$3:$J$38,5,FALSE)))))","v":""},{"$f":"IF(E46=\"\",\"\",VLOOKUP(BrewReport!$J27,Humle!$N$8:$Y$33,((ROUNDDOWN(($I$26/10),0)*10)-1000)/10-1,TRUE)*100)","v":""},{"$f":"IF(E46=\"\",\"\",IF(BrewReport!J27=\"\",\"\",(F46*G46*H46)/($E$5*10)))","v":""},null,2.6,250,250,144,null,"1,3 250 250 144"]
[130,100,null,null,{"$f":"IF(BrewReport!A28=\"\",\"\",BrewReport!A28)","v":""},{"$f":"IF(BrewReport!D28=\"\",\"\",BrewReport!D28)","v":""},{"$f":"IF(E47=\"\",\"\",IF(BrewReport!B28=\"\",\"\",IF(BrewReport!B28=\"Blomst\",VLOOKUP(E47,Humle!$A$3:$J$38,4,FALSE),IF(BrewReport!B28=\"Pellet\",VLOOKUP(E47,Humle!$A$3:$J$38,5,FALSE)))))","v":""},{"$f":"IF(E47=\"\",\"\",VLOOKUP(BrewReport!$J28,Humle!$N$8:$Y$33,((ROUNDDOWN(($I$26/10),0)*10)-1000)/10-1,TRUE)*100)","v":""},{"$f":"IF(E47=\"\",\"\",IF(BrewReport!J28=\"\",\"\",(F47*G47*H47)/($E$5*10)))","v":""},null,2.8,250,250,138,null,"1,4 250 250 138"]
[135,100,null,null,{"$f":"IF(BrewReport!A29=\"\",\"\",BrewReport!A29)","v":""},{"$f":"IF(BrewReport!D29=\"\",\"\",BrewReport!D29)","v":""},{"$f":"IF(E48=\"\",\"\",IF(BrewReport!B29=\"\",\"\",IF(BrewReport!B29=\"Blomst\",VLOOKUP(E48,Humle!$A$3:$J$38,4,FALSE),IF(BrewReport!B29=\"Pellet\",VLOOKUP(E48,Humle!$A$3:$J$38,5,FALSE)))))","v":""},{"$f":"IF(E48=\"\",\"\",VLOOKUP(BrewReport!$J29,Humle!$N$8:$Y$33,((ROUNDDOWN(($I$26/10),0)*10)-1000)/10-1,TRUE)*100)","v":""},{"$f":"IF(E48=\"\",\"\",IF(BrewReport!J29=\"\",\"\",(F48*G48*H48)/($E$5*10)))","v":""},null,3,250,250,133,null,"1,5 250 250 133"]
[140,100,null,null,null,null,null,null,"-",null,3.2,250,250,127,null,"1,6 250 250 127"]
[145,100,null,null,{"$f":"IF(BrewReport!A31=\"\",\"\",BrewReport!A31)","v":"Perle"},{"$f":"IF(BrewReport!D31=\"\",\"\",BrewReport!D31)","v":20},{"$f":"IF(E50=\"\",\"\",IF(BrewReport!B31=\"\",\"\",IF(BrewReport!B31=\"Blomst\",VLOOKUP(E50,Humle!$A$3:$J$38,4,FALSE),IF(BrewReport!B31=\"Pellet\",VLOOKUP(E50,Humle!$A$3:$J$38,5,FALSE)))))","v":4},{"$f":"IF(E50=\"\",\"\",VLOOKUP(BrewReport!$J31,Humle!$N$8:$Y$33,((ROUNDDOWN(($I$26/10),0)*10)-1000)/10-1,TRUE)*100)","v":7.0000000000000009},{"$f":"IF(E50=\"\",\"\",IF(BrewReport!J31=\"\",\"\",(F50*G50*H50)/($E$5*10)))","v":2.2400000000000007},null,3.3,250,250,122,null,"1,7 250 250 122"]
[150,100,null,null,{"$f":"IF(BrewReport!A32=\"\",\"\",BrewReport!A32)","v":""},{"$f":"IF(BrewReport!D32=\"\",\"\",BrewReport!D32)","v":""},{"$f":"IF(E51=\"\",\"\",IF(BrewReport!B32=\"\",\"\",IF(BrewReport!B32=\"Blomst\",VLOOKUP(E51,Humle!$A$3:$J$38,4,FALSE),IF(BrewReport!B32=\"Pellet\",VLOOKUP(E51,Humle!$A$3:$J$38,5,FALSE)))))","v":""},{"$f":"IF(E51=\"\",\"\",VLOOKUP(BrewReport!$J32,Humle!$N$8:$Y$33,((ROUNDDOWN(($I$26/10),0)*10)-1000)/10-1,TRUE)*100)","v":""},{"$f":"IF(E51=\"\",\"\",IF(BrewReport!J32=\"\",\"\",(F51*G51*H51)/($E$5*10)))","v":""},null,3.5,250,250,116,null,"1,8 250 250 116"]
[155,100,null,null,{"$f":"IF(BrewReport!A33=\"\",\"\",BrewReport!A33)","v":""},{"$f":"IF(BrewReport!D33=\"\",\"\",BrewReport!D33)","v":""},{"$f":"IF(E52=\"\",\"\",IF(BrewReport!B33=\"\",\"\",IF(BrewReport!B33=\"Blomst\",VLOOKUP(E52,Humle!$A$3:$J$38,4,FALSE),IF(BrewReport!B33=\"Pellet\",VLOOKUP(E52,Humle!$A$3:$J$38,5,FALSE)))))","v":""},{"$f":"IF(E52=\"\",\"\",VLOOKUP(BrewReport!$J33,Humle!$N$8:$Y$33,((ROUNDDOWN(($I$26/10),0)*10)-1000)/10-1,TRUE)*100)","v":""},{"$f":"IF(E52=\"\",\"\",IF(BrewReport!J33=\"\",\"\",(F52*G52*H52)/($E$5*10)))","v":""},null,3.7,250,250,111,null,"1,9 250 250 111"]
[160,100,null,null,{"$f":"IF(BrewReport!A34=\"\",\"\",BrewReport!A34)","v":"Andet"},null,null,null,"-",null,3.9,250,250,105,null,"2 250 250 105"]
[165,100,null,null,null,null,null,null,null,null,4.0999999999999996,250,250,100,null,"2,1 250 250 100"]
[170,100,null,null,null,"Total IBU:",null,null,{"$f":"SUM(I42:I53)","v":12.367999999999999},null,4.3,250,250,94,null,"2,2 250 250 94"]
[175,100,null,null,null,null,null,null,null,null,4.5,250,250,89,null,"2,3 250 250 89"]
[180,"",null,"BU:GU and RBR:","http://www.madalchemist.com/chart_bitterness_corrected.html",null,null,null,null,null,4.7,250,250,83,null,"2,4 250 250 83"]
[185,"",null,null,null,null,null,null,null,null,4.9000000000000004,250,250,78,null,"2,5 250 250 78"]
[190,"",null,null,null,null,null,null,null,null,5.0999999999999996,249,250,72,null,"2,6 249 250 72"]
[195,"",null,null,null,null,null,null,null,null,5.3,248,249,67,null,"2,7 248 249 67"]
[200,"",null,null,null,null,null,null,null,null,5.5,247,248,61,null,"2,8 247 248 61"]
[205,"",null,null,null,null,null,null,null,null,5.7,246,247,56,null,"2,9 246 247 56"]
[210,"",null,null,null,null,null,null,null,null,5.9,245,246,50,null,"3 245 246 50"]
[215,"",null,null,null,null,null,null,null,null,6.1,244,245,45,null,"3,1 244 245 45"]
[220,"",null,null,null,null,null,null,null,null,6.3,243,244,45,null,"3,2 243 244 45"]
[225,"",null,null,null,null,null,null,null,null,6.5,242,242,45,null,"3,3 242 242 45"]
[230,"",null,null,null,null,null,null,null,null,6.7,241,240,46,null,"3,4 241 240 46"]
[235,"",null,null,null,null,null,null,null,null,6.9,240,238,46,null,"3,5 240 238 46"]
[240,"",null,null,null,null,null,null,null,null,7.1,239,236,46,null,"3,6 239 236 46"]
[245,"",null,null,null,null,null,null,null,null,7.3,238,234,46,null,"3,7 238 234 46"]
[250,"",null,null,null,null,null,null,null,null,7.5,237,232,47,null,"3,8 237 232 47"]
[255,"",null,null,null,null,null,null,null,null,7.7,236,230,47,null,"3,9 236 230 47"]
[260,"",null,null,null,null,null,null,null,null,7.9,235,228,47,null,"4 235 228 47"]
[265,"",null,null,null,null,null,null,"RBR colour coding",null,8.1,234,226,47,null,"4,1 234 226 47"]
[270,"",null,null,null,null,null,null,"(extra hoppy)         > ",{"$f":"35/55","v":0.63636363636363635},8.3000000000000007,233,224,48,null,"4,2 233 224 48"]
[null,null,null,null,null,null,null,null,"(slightly hoppy)      > ",{"$f":"40/75","v":0.53333333333333333},8.5,232,222,48,null,"4,3 232 222 48"]
[null,null,null,null,null,null,null,null,"(evenly balanced)   > ",{"$f":"20/45","v":0.44444444444444442},8.6999999999999993,231,220,48,null,"4,4 231 220 48"]
[null,null,null,null,null,null,null,null,"(slightly malty)       > ",{"$f":"20/55","v":0.36363636363636365},8.9,230,218,48,null,"4,5 230 218 48"]
[null,null,null,null,null,null,null,null,"(extra malty)          < ",{"$f":"20/55","v":0.36363636363636365},9.1,229,216,49,null,"4,6 229 216 49"]
[null,null,null,null,null,null,null,null,null,null,9.3000000000000007,228,214,49,null,"4,7 228 214 49"]
[null,null,null,null,null,null,null,null,null,null,9.5,227,212,49,null,"4,8 227 212 49"]
[null,null,null,null,null,null,null,null,null,null,9.6999999999999993,226,210,49,null,"4,9 226 210 49"]
[null,null,null,null,null,null,null,null,null,null,9.9,225,208,50,null,"5 225 208 50"]
[null,null,null,null,null,null,null,null,null,null,10,224,206,50,null,"5,1 224 206 50"]
[null,null,null,null,null,null,null,null,null,null,10.199999999999999,223,204,50,null,"5,2 223 204 50"]
[null,null,null,null,null,null,null,null,null,null,10.4,222,202,50,null,"5,3 222 202 50"]
[null,null,null,null,null,null,null,null,null,null,10.6,221,200,51,null,"5,4 221 200 51"]
[null,null,null,null,null,null,null,null,null,null,10.8,220,198,51,null,"5,5 220 198 51"]
[null,null,null,null,null,null,null,null,null,null,11,219,196,51,null,"5,6 219 196 51"]
[null,null,null,null,null,null,null,null,null,null,11.2,218,194,51,null,"5,7 218 194 51"]
[null,null,null,null,null,null,null,null,null,null,11.4,217,192,52,null,"5,8 217 192 52"]
[null,null,null,null,null,null,null,null,null,null,11.6,216,190,52,null,"5,9 216 190 52"]
[null,null,null,null,null,null,null,null,null,null,11.8,215,188,52,null,"6 215 188 52"]
[null,null,null,null,null,null,null,null,null,null,12,214,186,52,null,"6,1 214 186 52"]
[null,null,null,null,null,null,null,null,null,null,12.2,213,184,53,null,"6,2 213 184 53"]
[null,null,null,null,null,null,null,null,null,null,12.4,212,182,53,null,"6,3 212 182 53"]
[null,null,null,null,null,null,null,null,null,null,12.6,211,180,53,null,"6,4 211 180 53"]
[null,null,null,null,null,null,null,null,null,null,12.8,210,178,53,null,"6,5 210 178 53"]
[null,null,null,null,null,null,null,null,null,null,13,209,176,54,null,"6,6 209 176 54"]
[null,null,null,null,null,null,null,null,null,null,13.2,208,174,54,null,"6,7 208 174 54"]
[null,null,null,null,null,null,null,null,null,null,13.4,207,172,54,null,"6,8 207 172 54"]
[null,null,null,null,null,null,null,null,null,null,13.6,206,170,54,null,"6,9 206 170 54"]
[null,null,null,null,null,null,null,null,null,null,13.8,205,168,55,null,"7 205 168 55"]
[null,null,null,null,null,null,null,null,null,null,14,204,166,55,null,"7,1 204 166 55"]
[null,null,null,null,null,null,null,null,null,null,14.2,203,164,55,null,"7,2 203 164 55"]
[null,null,null,null,null,null,null,null,null,null,14.4,202,162,55,null,"7,3 202 162 55"]
[null,null,null,null,null,null,null,null,null,null,14.6,201,160,56,null,"7,4 201 160 56"]
[null,null,null,null,null,null,null,null,null,null,14.8,200,158,56,null,"7,5 200 158 56"]
[null,null,null,null,null,null,null,null,null,null,15,200,156,56,null,"7,6 200 156 56"]
[null,null,null,null,null,null,null,null,null,null,15.2,199,154,56,null,"7,7 199 154 56"]
[null,null,null,null,null,null,null,null,null,null,15.4,199,152,56,null,"7,8 199 152 56"]
[null,null,null,null,null,null,null,null,null,null,15.6,198,150,56,null,"7,9 198 150 56"]
[null,null,null,null,null,null,null,null,null,null,15.8,198,148,56,null,"8 198 148 56"]
[null,null,null,null,null,null,null,null,null,null,16,197,146,56,null,"8,1 197 146 56"]
[null,null,null,null,null,null,null,null,null,null,16.2,197,144,56,null,"8,2 197 144 56"]
[null,null,null,null,null,null,null,null,null,null,16.399999999999999,196,142,56,null,"8,3 196 142 56"]
[null,null,null,null,null,null,null,null,null,null,16.5,196,141,56,null,"8,4 196 141 56"]
[null,null,null,null,null,null,null,null,null,null,16.7,195,140,56,null,"8,5 195 140 56"]
[null,null,null,null,null,null,null,null,null,null,16.899999999999999,195,139,56,null,"8,6 195 139 56"]
[null,null,null,null,null,null,null,null,null,null,17.100000000000001,194,139,56,null,"8,7 194 139 56"]
[null,null,null,null,null,null,null,null,null,null,17.3,194,138,56,null,"8,8 194 138 56"]
[null,null,null,null,null,null,null,null,null,null,17.5,193,137,56,null,"8,9 193 137 56"]
[null,null,null,null,null,null,null,null,null,null,17.7,193,136,56,null,"9 193 136 56"]
[null,null,null,null,null,null,null,null,null,null,17.899999999999999,192,136,56,null,"9,1 192 136 56"]
[null,null,null,null,null,null,null,null,null,null,18.100000000000001,192,135,56,null,"9,2 192 135 56"]
[null,null,null,null,null,null,null,null,null,null,18.3,192,134,56,null,"9,3 192 134 56"]
[null,null,null,null,null,null,null,null,null,null,18.5,192,133,56,null,"9,4 192 133 56"]
[null,null,null,null,null,null,null,null,null,null,18.7,192,133,56,null,"9,5 192 133 56"]
[null,null,null,null,null,null,null,null,null,null,18.899999999999999,192,132,56,null,"9,6 192 132 56"]
[null,null,null,null,null,null,null,null,null,null,19.100000000000001,192,131,56,null,"9,7 192 131 56"]
[null,null,null,null,null,null,null,null,null,null,19.3,192,130,56,null,"9,8 192 130 56"]
[null,null,null,null,null,null,null,null,null,null,19.5,192,130,56,null,"9,9 192 130 56"]
[null,null,null,null,null,null,null,null,null,null,19.7,192,129,56,null,"10 192 129 56"]
[null,null,null,null,null,null,null,null,null,null,19.899999999999999,192,128,56,null,"10,1 192 128 56"]
[null,null,null,null,null,null,null,null,null,null,20.100000000000001,192,127,56,null,"10,2 192 127 56"]
[null,null,null,null,null,null,null,null,null,null,20.3,192,127,56,null,"10,3 192 127 56"]
[null,null,null,null,null,null,null,null,null,null,20.5,192,126,56,null,"10,4 192 126 56"]
[null,null,null,null,null,null,null,null,null,null,20.7,192,125,56,null,"10,5 192 125 56"]
[null,null,null,null,null,null,null,null,null,null,20.9,192,124,56,null,"10,6 192 124 56"]
[null,null,null,null,null,null,null,null,null,null,21.1,192,124,56,null,"10,7 192 124 56"]
[null,null,null,null,null,null,null,null,null,null,21.3,192,123,56,null,"10,8 192 123 56"]
[null,null,null,null,null,null,null,null,null,null,21.5,192,122,56,null,"10,9 192 122 56"]
[null,null,null,null,null,null,null,null,null,null,21.7,192,121,56,null,"11 192 121 56"]
[null,null,null,null,null,null,null,null,null,null,21.9,192,121,56,null,"11,1 192 121 56"]
[null,null,null,null,null,null,null,null,null,null,22.1,192,120,56,null,"11,2 192 120 56"]
[null,null,null,null,null,null,null,null,null,null,22.3,192,119,56,null,"11,3 192 119 56"]
[null,null,null,null,null,null,null,null,null,null,22.5,192,118,56,null,"11,4 192 118 56"]
[null,null,null,null,null,null,null,null,null,null,22.7,192,118,56,null,"11,5 192 118 56"]
[null,null,null,null,null,null,null,null,null,null,22.9,192,117,56,null,"11,6 192 117 56"]
[null,null,null,null,null,null,null,null,null,null,23,192,116,56,null,"11,7 192 116 56"]
[null,null,null,null,null,null,null,null,null,null,23.2,192,115,56,null,"11,8 192 115 56"]
[null,null,null,null,null,null,null,null,null,null,23.4,192,115,56,null,"11,9 192 115 56"]
[null,null,null,null,null,null,null,null,null,null,23.6,192,114,56,null,"12 192 114 56"]
[null,null,null,null,null,null,null,null,null,null,23.8,192,113,56,null,"12,1 192 113 56"]
[null,null,null,null,null,null,null,null,null,null,24,192,112,56,null,"12,2 192 112 56"]
[null,null,null,null,null,null,null,null,null,null,24.2,192,112,56,null,"12,3 192 112 56"]
[null,null,null,null,null,null,null,null,null,null,24.4,192,111,56,null,"12,4 192 111 56"]
[null,null,null,null,null,null,null,null,null,null,24.6,192,110,56,null,"12,5 192 110 56"]
[null,null,null,null,null,null,null,null,null,null,24.8,192,109,56,null,"12,6 192 109 56"]
[null,null,null,null,null,null,null,null,null,null,25,192,109,56,null,"12,7 192 109 56"]
[null,null,null,null,null,null,null,null,null,null,25.2,192,108,56,null,"12,8 192 108 56"]
[null,null,null,null,null,null,null,null,null,null,25.4,191,107,56,null,"12,9 191 107 56"]
[null,null,null,null,null,null,null,null,null,null,25.6,190,106,56,null,"13 190 106 56"]
[null,null,null,null,null,null,null,null,null,null,25.8,189,106,56,null,"13,1 189 106 56"]
[null,null,null,null,null,null,null,null,null,null,26,188,105,56,null,"13,2 188 105 56"]
[null,null,null,null,null,null,null,null,null,null,26.2,187,104,56,null,"13,3 187 104 56"]
[null,null,null,null,null,null,null,null,null,null,26.4,186,103,56,null,"13,4 186 103 56"]
[null,null,null,null,null,null,null,null,null,null,26.6,185,103,56,null,"13,5 185 103 56"]
[null,null,null,null,null,null,null,null,null,null,26.8,184,102,56,null,"13,6 184 102 56"]
[null,null,null,null,null,null,null,null,null,null,27,183,101,56,null,"13,7 183 101 56"]
[null,null,null,null,null,null,null,null,null,null,27.2,182,100,56,null,"13,8 182 100 56"]
[null,null,null,null,null,null,null,null,null,null,27.4,181,100,56,null,"13,9 181 100 56"]
[null,null,null,null,null,null,null,null,null,null,27.6,180,99,56,null,"14 180 99 56"]
[null,null,null,null,null,null,null,null,null,null,27.8,179,98,56,null,"14,1 179 98 56"]
[null,null,null,null,null,null,null,null,null,null,28,178,97,56,null,"14,2 178 97 56"]
[null,null,null,null,null,null,null,null,null,null,28.2,177,97,56,null,"14,3 177 97 56"]
[null,null,null,null,null,null,null,null,null,null,28.4,175,96,55,null,"14,4 175 96 55"]
[null,null,null,null,null,null,null,null,null,null,28.6,174,95,55,null,"14,5 174 95 55"]
[null,null,null,null,null,null,null,null,null,null,28.8,172,94,55,null,"14,6 172 94 55"]
[null,null,null,null,null,null,null,null,null,null,29,171,94,55,null,"14,7 171 94 55"]
[null,null,null,null,null,null,null,null,null,null,29.2,169,93,54,null,"14,8 169 93 54"]
[null,null,null,null,null,null,null,null,null,null,29.4,168,92,54,null,"14,9 168 92 54"]
[null,null,null,null,null,null,null,null,null,null,29.6,167,91,54,null,"15 167 91 54"]
[null,null,null,null,null,null,null,null,null,null,29.7,165,91,54,null,"15,1 165 91 54"]
[null,null,null,null,null,null,null,null,null,null,29.9,164,90,53,null,"15,2 164 90 53"]
[null,null,null,null,null,null,null,null,null,null,30.1,162,89,53,null,"15,3 162 89 53"]
[null,null,null,null,null,null,null,null,null,null,30.3,161,88,53,null,"15,4 161 88 53"]
[null,null,null,null,null,null,null,null,null,null,30.5,159,88,53,null,"15,5 159 88 53"]
[null,null,null,null,null,null,null,null,null,null,30.7,158,87,52,null,"15,6 158 87 52"]
[null,null,null,null,null,null,null,null,null,null,30.9,157,86,52,null,"15,7 157 86 52"]
[null,null,null,null,null,null,null,null,null,null,31.1,155,85,52,null,"15,8 155 85 52"]
[null,null,null,null,null,null,null,null,null,null,31.3,154,85,52,null,"15,9 154 85 52"]
[null,null,null,null,null,null,null,null,null,null,31.5,152,84,51,null,"16 152 84 51"]
[null,null,null,null,null,null,null,null,null,null,31.7,151,83,51,null,"16,1 151 83 51"]
[null,null,null,null,null,null,null,null,null,null,31.9,149,82,51,null,"16,2 149 82 51"]
[null,null,null,null,null,null,null,null,null,null,32.1,148,82,51,null,"16,3 148 82 51"]
[null,null,null,null,null,null,null,null,null,null,32.299999999999997,147,81,50,null,"16,4 147 81 50"]
[null,null,null,null,null,null,null,null,null,null,32.5,145,80,50,null,"16,5 145 80 50"]
[null,null,null,null,null,null,null,null,null,null,32.700000000000003,144,79,50,null,"16,6 144 79 50"]
[null,null,null,null,null,null,null,null,null,null,32.9,142,78,50,null,"16,7 142 78 50"]
[null,null,null,null,null,null,null,null,null,null,33.1,141,77,49,null,"16,8 141 77 49"]
[null,null,null,null,null,null,null,null,null,null,33.299999999999997,139,76,49,null,"16,9 139 76 49"]
[null,null,null,null,null,null,null,null,null,null,33.5,138,75,48,null,"17 138 75 48"]
[null,null,null,null,null,null,null,null,null,null,33.700000000000003,137,75,47,null,"17,1 137 75 47"]
[null,null,null,null,null,null,null,null,null,null,33.9,135,74,47,null,"17,2 135 74 47"]
[null,null,null,null,null,null,null,null,null,null,34.1,134,73,46,null,"17,3 134 73 46"]
[null,null,null,null,null,null,null,null,null,null,34.299999999999997,132,72,45,null,"17,4 132 72 45"]
[null,null,null,null,null,null,null,null,null,null,34.5,131,72,45,null,"17,5 131 72 45"]
[null,null,null,null,null,null,null,null,null,null,34.700000000000003,129,71,44,null,"17,6 129 71 44"]
[null,null,null,null,null,null,null,null,null,null,34.9,128,70,43,null,"17,7 128 70 43"]
[null,null,null,null,null,null,null,null,null,null,35.1,127,69,43,null,"17,8 127 69 43"]
[null,null,null,null,null,null,null,null,null,null,35.299999999999997,125,69,42,null,"17,9 125 69 42"]
[null,null,null,null,null,null,null,null,null,null,35.5,124,68,41,null,"18 124 68 41"]
[null,null,null,null,null,null,null,null,null,null,35.700000000000003,122,67,41,null,"18,1 122 67 41"]
[null,null,null,null,null,null,null,null,null,null,35.9,121,66,40,null,"18,2 121 66 40"]
[null,null,null,null,null,null,null,null,null,null,36.1,119,66,39,null,"18,3 119 66 39"]
[null,null,null,null,null,null,null,null,null,null,36.200000000000003,118,65,39,null,"18,4 118 65 39"]
[null,null,null,null,null,null,null,null,null,null,36.4,117,64,38,null,"18,5 117 64 38"]
[null,null,null,null,null,null,null,null,null,null,36.6,115,63,37,null,"18,6 115 63 37"]
[null,null,null,null,null,null,null,null,null,null,36.799999999999997,114,63,37,null,"18,7 114 63 37"]
[null,null,null,null,null,null,null,null,null,null,37,112,62,36,null,"18,8 112 62 36"]
[null,null,null,null,null,null,null,null,null,null,37.200000000000003,111,61,35,null,"18,9 111 61 35"]
[null,null,null,null,null,null,null,null,null,null,37.4,109,60,34,null,"19 109 60 34"]
[null,null,null,null,null,null,null,null,null,null,37.6,108,60,33,null,"19,1 108 60 33"]
[null,null,null,null,null,null,null,null,null,null,37.799999999999997,107,59,32,null,"19,2 107 59 32"]
[null,null,null,null,null,null,null,null,null,null,38,105,58,31,null,"19,3 105 58 31"]
[null,null,null,null,null,null,null,null,null,null,38.200000000000003,104,57,29,null,"19,4 104 57 29"]
[null,null,null,null,null,null,null,null,null,null,38.4,102,57,28,null,"19,5 102 57 28"]
[null,null,null,null,null,null,null,null,null,null,38.6,101,56,27,null,"19,6 101 56 27"]
[null,null,null,null,null,null,null,null,null,null,38.799999999999997,99,55,26,null,"19,7 99 55 26"]
[null,null,null,null,null,null,null,null,null,null,39,98,54,25,null,"19,8 98 54 25"]
[null,null,null,null,null,null,null,null,null,null,39.200000000000003,97,54,24,null,"19,9 97 54 24"]
[null,null,null,null,null,null,null,null,null,null,39.4,95,53,23,null,"20 95 53 23"]
[null,null,null,null,null,null,null,null,null,null,39.6,94,52,21,null,"20,1 94 52 21"]
[null,null,null,null,null,null,null,null,null,null,39.799999999999997,92,51,20,null,"20,2 92 51 20"]
[null,null,null,null,null,null,null,null,null,null,40,91,51,19,null,"20,3 91 51 19"]
[null,null,null,null,null,null,null,null,null,null,40.200000000000003,89,50,18,null,"20,4 89 50 18"]
[null,null,null,null,null,null,null,null,null,null,40.4,88,49,17,null,"20,5 88 49 17"]
[null,null,null,null,null,null,null,null,null,null,40.6,87,48,16,null,"20,6 87 48 16"]
[null,null,null,null,null,null,null,null,null,null,40.799999999999997,85,48,15,null,"20,7 85 48 15"]
[null,null,null,null,null,null,null,null,null,null,41,84,47,13,null,"20,8 84 47 13"]
[null,null,null,null,null,null,null,null,null,null,41.2,82,46,12,null,"20,9 82 46 12"]
[null,null,null,null,null,null,null,null,null,null,41.4,81,45,11,null,"21 81 45 11"]
[null,null,null,null,null,null,null,null,null,null,41.6,79,45,10,null,"21,1 79 45 10"]
[null,null,null,null,null,null,null,null,null,null,41.8,78,44,9,null,"21,2 78 44 9"]
[null,null,null,null,null,null,null,null,null,null,42,77,43,8,null,"21,3 77 43 8"]
[null,null,null,null,null,null,null,null,null,null,42.2,75,42,9,null,"21,4 75 42 9"]
[null,null,null,null,null,null,null,null,null,null,42.4,74,42,9,null,"21,5 74 42 9"]
[null,null,null,null,null,null,null,null,null,null,42.6,72,41,10,null,"21,6 72 41 10"]
[null,null,null,null,null,null,null,null,null,null,42.7,71,40,10,null,"21,7 71 40 10"]
[null,null,null,null,null,null,null,null,null,null,42.9,69,39,11,null,"21,8 69 39 11"]
[null,null,null,null,null,null,null,null,null,null,43.1,68,39,11,null,"21,9 68 39 11"]
[null,null,null,null,null,null,null,null,null,null,43.3,67,38,12,null,"22 67 38 12"]
[null,null,null,null,null,null,null,null,null,null,43.5,65,37,12,null,"22,1 65 37 12"]
[null,null,null,null,null,null,null,null,null,null,43.7,64,36,13,null,"22,2 64 36 13"]
[null,null,null,null,null,null,null,null,null,null,43.9,62,36,13,null,"22,3 62 36 13"]
[null,null,null,null,null,null,null,null,null,null,44.1,61,35,14,null,"22,4 61 35 14"]
[null,null,null,null,null,null,null,null,null,null,44.3,59,34,14,null,"22,5 59 34 14"]
[null,null,null,null,null,null,null,null,null,null,44.5,58,33,15,null,"22,6 58 33 15"]
[null,null,null,null,null,null,null,null,null,null,44.7,57,33,15,null,"22,7 57 33 15"]
[null,null,null,null,null,null,null,null,null,null,44.9,55,32,16,null,"22,8 55 32 16"]
[null,null,null,null,null,null,null,null,null,null,45.1,54,31,16,null,"22,9 54 31 16"]
[null,null,null,null,null,null,null,null,null,null,45.3,52,30,17,null,"23 52 30 17"]
[null,null,null,null,null,null,null,null,null,null,45.5,51,30,17,null,"23,1 51 30 17"]
[null,null,null,null,null,null,null,null,null,null,45.7,49,29,18,null,"23,2 49 29 18"]
[null,null,null,null,null,null,null,null,null,null,45.9,48,28,18,null,"23,3 48 28 18"]
[null,null,null,null,null,null,null,null,null,null,46.1,47,27,19,null,"23,4 47 27 19"]
[null,null,null,null,null,null,null,null,null,null,46.3,45,27,19,null,"23,5 45 27 19"]
[null,null,null,null,null,null,null,null,null,null,46.5,44,26,20,null,"23,6 44 26 20"]
[null,null,null,null,null,null,null,null,null,null,46.7,42,25,20,null,"23,7 42 25 20"]
[null,null,null,null,null,null,null,null,null,null,46.9,41,24,21,null,"23,8 41 24 21"]
[null,null,null,null,null,null,null,null,null,null,47.1,39,24,21,null,"23,9 39 24 21"]
[null,null,null,null,null,null,null,null,null,null,47.3,38,23,22,null,"24 38 23 22"]
[null,null,null,null,null,null,null,null,null,null,47.5,37,22,21,null,"24,1 37 22 21"]
[null,null,null,null,null,null,null,null,null,null,47.7,37,22,21,null,"24,2 37 22 21"]
[null,null,null,null,null,null,null,null,null,null,47.9,36,22,21,null,"24,3 36 22 21"]
[null,null,null,null,null,null,null,null,null,null,48.1,36,21,20,null,"24,4 36 21 20"]
[null,null,null,null,null,null,null,null,null,null,48.3,35,21,20,null,"24,5 35 21 20"]
[null,null,null,null,null,null,null,null,null,null,48.5,35,21,20,null,"24,6 35 21 20"]
[null,null,null,null,null,null,null,null,null,null,48.7,34,20,19,null,"24,7 34 20 19"]
[null,null,null,null,null,null,null,null,null,null,48.9,34,20,19,null,"24,8 34 20 19"]
[null,null,null,null,null,null,null,null,null,null,49.1,33,20,19,null,"24,9 33 20 19"]
[null,null,null,null,null,null,null,null,null,null,49.3,33,19,18,null,"25 33 19 18"]
[null,null,null,null,null,null,null,null,null,null,49.4,32,19,18,null,"25,1 32 19 18"]
[null,null,null,null,null,null,null,null,null,null,49.6,32,19,18,null,"25,2 32 19 18"]
[null,null,null,null,null,null,null,null,null,null,49.8,31,18,17,null,"25,3 31 18 17"]
[null,null,null,null,null,null,null,null,null,null,50,31,18,17,null,"25,4 31 18 17"]
[null,null,null,null,null,null,null,null,null,null,50.2,30,18,17,null,"25,5 30 18 17"]
[null,null,null,null,null,null,null,null,null,null,50.4,30,17,16,null,"25,6 30 17 16"]
[null,null,null,null,null,null,null,null,null,null,50.6,29,17,16,null,"25,7 29 17 16"]
[null,null,null,null,null,null,null,null,null,null,50.8,29,17,16,null,"25,8 29 17 16"]
[null,null,null,null,null,null,null,null,null,null,51,28,16,15,null,"25,9 28 16 15"]
[null,null,null,null,null,null,null,null,null,null,51.2,28,16,15,null,"26 28 16 15"]
[null,null,null,null,null,null,null,null,null,null,51.4,27,16,15,null,"26,1 27 16 15"]
[null,null,null,null,null,null,null,null,null,null,51.6,27,15,14,null,"26,2 27 15 14"]
[null,null,null,null,null,null,null,null,null,null,51.8,26,15,14,null,"26,3 26 15 14"]
[null,null,null,null,null,null,null,null,null,null,52,26,15,14,null,"26,4 26 15 14"]
[null,null,null,null,null,null,null,null,null,null,52.2,25,14,13,null,"26,5 25 14 13"]
[null,null,null,null,null,null,null,null,null,null,52.4,25,14,13,null,"26,6 25 14 13"]
[null,null,null,null,null,null,null,null,null,null,52.6,24,14,13,null,"26,7 24 14 13"]
[null,null,null,null,null,null,null,null,null,null,52.8,24,13,12,null,"26,8 24 13 12"]
[null,null,null,null,null,null,null,null,null,null,53,23,13,12,null,"26,9 23 13 12"]
[null,null,null,null,null,null,null,null,null,null,53.2,23,13,12,null,"27 23 13 12"]
[null,null,null,null,null,null,null,null,null,null,53.4,22,12,11,null,"27,1 22 12 11"]
[null,null,null,null,null,null,null,null,null,null,53.6,22,12,11,null,"27,2 22 12 11"]
[null,null,null,null,null,null,null,null,null,null,53.8,21,12,11,null,"27,3 21 12 11"]
[null,null,null,null,null,null,null,null,null,null,54,21,11,10,null,"27,4 21 11 10"]
[null,null,null,null,null,null,null,null,null,null,54.2,20,11,10,null,"27,5 20 11 10"]
[null,null,null,null,null,null,null,null,null,null,54.4,20,11,10,null,"27,6 20 11 10"]
[null,null,null,null,null,null,null,null,null,null,54.6,19,10,9,null,"27,7 19 10 9"]
[null,null,null,null,null,null,null,null,null,null,54.8,19,10,9,null,"27,8 19 10 9"]
[null,null,null,null,null,null,null,null,null,null,55,18,10,9,null,"27,9 18 10 9"]
[null,null,null,null,null,null,null,null,null,null,55.2,18,9,8,null,"28 18 9 8"]
[null,null,null,null,null,null,null,null,null,null,55.4,17,9,8,null,"28,1 17 9 8"]
[null,null,null,null,null,null,null,null,null,null,55.6,17,9,8,null,"28,2 17 9 8"]
[null,null,null,null,null,null,null,null,null,null,55.8,16,8,7,null,"28,3 16 8 7"]
[null,null,null,null,null,null,null,null,null,null,55.9,16,8,7,null,"28,4 16 8 7"]
[null,null,null,null,null,null,null,null,null,null,56.1,15,8,7,null,"28,5 15 8 7"]
[null,null,null,null,null,null,null,null,null,null,56.3,15,7,6,null,"28,6 15 7 6"]
[null,null,null,null,null,null,null,null,null,null,56.5,14,7,6,null,"28,7 14 7 6"]
[null,null,null,null,null,null,null,null,null,null,56.7,14,7,6,null,"28,8 14 7 6"]
[null,null,null,null,null,null,null,null,null,null,56.9,13,6,5,null,"28,9 13 6 5"]
[null,null,null,null,null,null,null,null,null,null,57.1,13,6,5,null,"29 13 6 5"]
[null,null,null,null,null,null,null,null,null,null,57.3,12,6,5,null,"29,1 12 6 5"]
[null,null,null,null,null,null,null,null,null,null,57.5,12,5,4,null,"29,2 12 5 4"]
[null,null,null,null,null,null,null,null,null,null,57.7,11,5,4,null,"29,3 11 5 4"]
[null,null,null,null,null,null,null,null,null,null,57.9,11,5,4,null,"29,4 11 5 4"]
[null,null,null,null,null,null,null,null,null,null,58.1,10,4,3,null,"29,5 10 4 3"]
[null,null,null,null,null,null,null,null,null,null,58.3,10,4,3,null,"29,6 10 4 3"]
[null,null,null,null,null,null,null,null,null,null,58.5,9,4,3,null,"29,7 9 4 3"]
[null,null,null,null,null,null,null,null,null,null,58.7,9,3,2,null,"29,8 9 3 2"]
[null,null,null,null,null,null,null,null,null,null,58.9,8,3,2,null,"29,9 8 3 2"]
[null,null,null,null,null,null,null,null,null,null,59.1,8,3,2,null,"30 8 3 2"]

{"sheet":"Omregninger","index":4,"n_rows":178,"n_cols":8,"rows_kept":178,"cut":false,"hidden":false,"merged":[[9,0,9,7],[1,0,1,7],[35,6,35,7],[33,1,33,4],[44,1,44,3],[11,1,11,2],[11,4,11,5],[34,1,34,4],[29,1,29,2],[28,1,28,2],[27,1,27,2],[26,1,26,2],[25,1,25,2],[24,1,24,2],[23,1,23,3]]}
[]
["Farver:"]
[]
[null,"Formål","Formel","Indtast","Beregn","Resultat"]
[null,"EBC to SRM:","SRM = EBC × 0,508","Indtast EBC",null,{"$f":"IF(E5=\"\",\"\",ROUND((E5*0.508),0))","v":""}]
[null,"SRM to EBC:","EBC = SRM × 1,97","Indtast SRM",null,{"$f":"IF(E6=\"\",\"\",ROUND((E6*1.97),0))","v":""}]
[null,"Lovibond to SRM:","SRM = (1,3546 × °L) - 0,76","Indtast °L",null,{"$f":"IF(E7=\"\",\"\",ROUND(((1.3546*E7)-0.76),0))","v":""}]
[null,"SRM to Lovibond:","°L = (SRM + 0,76) ÷ 1,3546","Indtast SRM",null,{"$f":"IF(E8=\"\",\"\",ROUND(((E8+0.76)/1.3546),0))","v":""}]
[]
["Vægt, rumfang og temperatur"]
[]
[null,"US Mål                                        ◄",null,"Indtast","►                                  Metriske Mål"]
[null,"Ounce",{"$f":"IF(D13=\"\",\"\",D13/28.35)","v":""},null,{"$f":"IF(D13=\"\",\"\",D13*28.35)","v":""},"Gram"]
[null,"Pound",{"$f":"IF(D14=\"\",\"\",D14/453.6)","v":""},null,{"$f":"IF(D14=\"\",\"\",D14*453.6)","v":""},"Gram"]
[]
[null,"Pint",{"$f":"IF(D16=\"\",\"\",D16/0.473)","v":""},null,{"$f":"IF(D16=\"\",\"\",D16*0.473)","v":""},"Liter"]
[null,"Quart",{"$f":"IF(D17=\"\",\"\",D17/0.946)","v":""},null,{"$f":"IF(D17=\"\",\"\",D17*0.946)","v":""},"Liter"]
[null,"Gallon",{"$f":"IF(D18=\"\",\"\",D18/3.785)","v":""},null,{"$f":"IF(D18=\"\",\"\",D18*3.785)","v":""},"Liter"]
[]
[null,"Fahrenheit",{"$f":"IF(D20=\"\",\"\",D20*1.8 +32)","v":""},null,{"$f":"IF(D20=\"\",\"\",(D20-32)/1.8)","v":""},"Celsius"]
[]
["Humle"]
[]
[null,"AAU konvertering til humlemængde - (Alpha Acid Units)"]
[null,"Vælg Humletype:"]
[null,"Indtast antal AAU"]
[null,"Orig. opskrifts mængde - hvis forskellig fra 5 Gallons"]
[null,{"$f":"CONCATENATE(\"Indtast din brygmængde - hvis forskellig fra \",Data!E5,\" liter\")","v":"Indtast din brygmængde - hvis forskellig fra 25 liter"}]
[]
[null,"Tilsvarende mængde humle i dit bryg vil være:",null,{"$f":"IF(D25=\"\",\"\",CONCATENATE(IF(D28=\"\",ROUND((((D26/IFERROR(VLOOKUP(D25,Humle!A4:D38,4,FALSE),\"\"))*28.35/IF(D27=\"\",5*3.785,D27*3.785))*25),1),ROUND((((D26/IFERROR(VLOOKUP(D25,Humle!A4:D38,4,FALSE),\"\"))*28.35/IF(D27=\"\",5*3.785,D27*3.785))*D28),1)),\" Gram\"))","v":""}]
[]
["Refraktometer:"]
[]
[null,"Udregning af Final Gravity med Refraktometer måling - med kompensation for fejlvisning grundet alkohol"]
[null,"Input er i Oechsle, hvor gravity 1080 eller 1,080 = 80 Oe"]
[null,"Indtast Original Gravity","Oe","Indtast Final Gravity","Oe",null,"Specific Gravity-Brix Conversion Table"]
[null,"Refrektometer Input  -  OG",67,"Refrektometer Input - FG",37,null,"Specific Gravity","Brix"]
[null,"Brix mellemregning",{"$f":"VLOOKUP((C37/1000)+1,$G$37:$H$178,2,FALSE)","v":16.34},"Brix mellemregning",{"$f":"VLOOKUP((E37/1000)+1,$G$37:$H$178,2,FALSE)","v":9.26},null,0.99,0]
[null,"Mellemregning",-2.3184740000000001E-3,{"$f":"1.001843+C39*C38","v":0.96395913484000006},null,null,0.99099999999999999,0]
[null,"Mellemregning",-7.7750000000000009E-6,{"$f":"C40*C38*C38","v":-2.0758907900000003E-3},null,null,0.99199999999999999,0]
[null,"Mellemregning",-3.4E-8,{"$f":"C41*C38*C38*C38","v":-1.48332075536E-4},null,null,0.99299999999999999,0]
[null,"Mellemregning",5.7400000000000003E-3,{"$f":"C42*E38","v":5.3152400000000002E-2},null,null,0.99399999999999999,0]
[null,"Mellemregning",3.3439999999999998E-5,{"$f":"C43*E38*E38","v":2.8673997440000001E-3},null,null,0.995,0]
[null,"Mellemregning",8.6000000000000002E-8,{"$f":"C44*E38*E38*E38","v":6.8285958735999987E-5},null,null,0.996,0]
[null,"Udregnet  Final Gravity  ( kompenseret for alkohol )  =",null,null,{"$f":"SUM(D39:D44)","v":1.0178229976772002},null,0.997,0]
[null,null,null,null,null,null,0.998,0]
[null,null,null,null,null,null,0.999,0]
[null,null,null,null,null,null,1,0]
[null,null,null,null,null,null,1.0009999999999999,0.26]
[null,null,null,null,null,null,1.002,0.51]
[null,null,null,null,null,null,1.0029999999999999,0.77]
[null,null,null,null,null,null,1.004,1.03]
[null,null,null,null,null,null,1.0049999999999999,1.28]
[null,null,null,null,null,null,1.006,1.54]
[null,null,null,null,null,null,1.0069999999999999,1.8]
[null,null,null,null,null,null,1.008,2.0499999999999998]
[null,null,null,null,null,null,1.0089999999999999,2.31]
[null,null,null,null,null,null,1.01,2.56]
[null,null,null,null,null,null,1.0109999999999999,2.81]
[null,null,null,null,null,null,1.012,3.07]
[null,null,null,null,null,null,1.0129999999999999,3.32]
[null,null,null,null,null,null,1.014,3.57]
[null,null,null,null,null,null,1.0149999999999999,3.82]
[null,null,null,null,null,null,1.016,4.08]
[null,null,null,null,null,null,1.0169999999999999,4.33]
[null,null,null,null,null,null,1.018,4.58]
[null,null,null,null,null,null,1.0189999999999999,4.83]
[null,null,null,null,null,null,1.02,5.08]
[null,null,null,null,null,null,1.0209999999999999,5.33]
[null,null,null,null,null,null,1.022,5.57]
[null,null,null,null,null,null,1.0229999999999999,5.82]
[null,null,null,null,null,null,1.024,6.07]
[null,null,null,null,null,null,1.0249999999999999,6.32]
[null,null,null,null,null,null,1.026,6.57]
[null,null,null,null,null,null,1.0269999999999999,6.81]
[null,null,null,null,null,null,1.028,7.06]
[null,null,null,null,null,null,1.0289999999999999,7.3]
[null,null,null,null,null,null,1.03,7.55]
[null,null,null,null,null,null,1.0309999999999999,7.8]
[null,null,null,null,null,null,1.032,8.0399999999999991]
[null,null,null,null,null,null,1.0329999999999999,8.2799999999999994]
[null,null,null,null,null,null,1.034,8.5299999999999994]
[null,null,null,null,null,null,1.0349999999999999,8.77]
[null,null,null,null,null,null,1.036,9.01]
[null,null,null,null,null,null,1.0369999999999999,9.26]
[null,null,null,null,null,null,1.038,9.5]
[null,null,null,null,null,null,1.0389999999999999,9.74]
[null,null,null,null,null,null,1.04,9.98]
[null,null,null,null,null,null,1.0409999999999999,10.220000000000001]
[null,null,null,null,null,null,1.042,10.46]
[null,null,null,null,null,null,1.0429999999999999,10.7]
[null,null,null,null,null,null,1.044,10.94]
[null,null,null,null,null,null,1.0449999999999999,11.18]
[null,null,null,null,null,null,1.046,11.42]
[null,null,null,null,null,null,1.0469999999999999,11.66]
[null,null,null,null,null,null,1.048,11.9]
[null,null,null,null,null,null,1.0489999999999999,12.14]
[null,null,null,null,null,null,1.05,12.37]
[null,null,null,null,null,null,1.0509999999999999,12.61]
[null,null,null,null,null,null,1.052,12.85]
[null,null,null,null,null,null,1.0529999999999999,13.08]
[null,null,null,null,null,null,1.054,13.32]
[null,null,null,null,null,null,1.0549999999999999,13.55]
[null,null,null,null,null,null,1.056,13.79]
[null,null,null,null,null,null,1.0569999999999999,14.02]
[null,null,null,null,null,null,1.0580000000000001,14.26]
[null,null,null,null,null,null,1.0589999999999999,14.49]
[null,null,null,null,null,null,1.06,14.72]
[null,null,null,null,null,null,1.0609999999999999,14.96]
[null,null,null,null,null,null,1.0620000000000001,15.19]
[null,null,null,null,null,null,1.0629999999999999,15.42]
[null,null,null,null,null,null,1.0640000000000001,15.65]
[null,null,null,null,null,null,1.0649999999999999,15.88]
[null,null,null,null,null,null,1.0660000000000001,16.11]
[null,null,null,null,null,null,1.0669999999999999,16.34]
[null,null,null,null,null,null,1.0680000000000001,16.57]
[null,null,null,null,null,null,1.069,16.8]
[null,null,null,null,null,null,1.07,17.03]
[null,null,null,null,null,null,1.071,17.260000000000002]
[null,null,null,null,null,null,1.0720000000000001,17.489999999999998]
[null,null,null,null,null,null,1.073,17.72]
[null,null,null,null,null,null,1.0740000000000001,17.95]
[null,null,null,null,null,null,1.075,18.18]
[null,null,null,null,null,null,1.0760000000000001,18.399999999999999]
[null,null,null,null,null,null,1.077,18.63]
[null,null,null,null,null,null,1.0780000000000001,18.86]
[null,null,null,null,null,null,1.079,19.079999999999998]
[null,null,null,null,null,null,1.08,19.309999999999999]
[null,null,null,null,null,null,1.081,19.53]
[null,null,null,null,null,null,1.0820000000000001,19.760000000000002]
[null,null,null,null,null,null,1.083,19.98]
[null,null,null,null,null,null,1.0840000000000001,20.21]
[null,null,null,null,null,null,1.085,20.43]
[null,null,null,null,null,null,1.0860000000000001,20.65]
[null,null,null,null,null,null,1.087,20.88]
[null,null,null,null,null,null,1.0880000000000001,21.1]
[null,null,null,null,null,null,1.089,21.32]
[null,null,null,null,null,null,1.0900000000000001,21.54]
[null,null,null,null,null,null,1.091,21.77]
[null,null,null,null,null,null,1.0920000000000001,21.99]
[null,null,null,null,null,null,1.093,22.21]
[null,null,null,null,null,null,1.0940000000000001,22.43]
[null,null,null,null,null,null,1.095,22.65]
[null,null,null,null,null,null,1.0960000000000001,22.87]
[null,null,null,null,null,null,1.097,23.09]
[null,null,null,null,null,null,1.0980000000000001,23.31]
[null,null,null,null,null,null,1.099,23.53]
[null,null,null,null,null,null,1.1000000000000001,23.75]
[null,null,null,null,null,null,1.101,23.96]
[null,null,null,null,null,null,1.1020000000000001,24.18]
[null,null,null,null,null,null,1.103,24.4]
[null,null,null,null,null,null,1.1040000000000001,24.62]
[null,null,null,null,null,null,1.105,24.83]
[null,null,null,null,null,null,1.1060000000000001,25.05]
[null,null,null,null,null,null,1.107,25.27]
[null,null,null,null,null,null,1.1080000000000001,25.48]
[null,null,null,null,null,null,1.109,25.7]
[null,null,null,null,null,null,1.1100000000000001,25.91]
[null,null,null,null,null,null,1.111,26.13]
[null,null,null,null,null,null,1.1120000000000001,26.34]
[null,null,null,null,null,null,1.113,26.56]
[null,null,null,null,null,null,1.1140000000000001,26.77]
[null,null,null,null,null,null,1.115,26.98]
[null,null,null,null,null,null,1.1160000000000001,27.2]
[null,null,null,null,null,null,1.117,27.41]
[null,null,null,null,null,null,1.1180000000000001,27.62]
[null,null,null,null,null,null,1.119,27.83]
[null,null,null,null,null,null,1.1200000000000001,28.05]
[null,null,null,null,null,null,1.121,28.26]
[null,null,null,null,null,null,1.1220000000000001,28.47]
[null,null,null,null,null,null,1.123,28.68]
[null,null,null,null,null,null,1.1240000000000001,28.89]
[null,null,null,null,null,null,1.125,29.1]
[null,null,null,null,null,null,1.1259999999999999,29.31]
[null,null,null,null,null,null,1.127,29.52]
[null,null,null,null,null,null,1.1279999999999999,29.73]
[null,null,null,null,null,null,1.129,29.94]
[null,null,null,null,null,null,1.1299999999999999,30.15]

{"sheet":"Malt","index":5,"n_rows":82,"n_cols":16,"rows_kept":82,"cut":false,"hidden":false,"merged":[[77,1,77,2]]}
["Malttyper","EBC Range","EBC Avg.","Ekstraktudbytte","Karakteristik","Malt i kg","Brygladen","Hjemmebryggeren","Albryg (10g interval)","Bryglageret","Brygforretningen",null,"Malt Pris\nGrupper","Priser\nkr./kg",null,"DropDown Menu"]
["Basis Malt",null,null,null,null,null,"G","H","I","J","K",null,null,15]
["Pilsner","2,5 - 4,0","3,25","300","Høj enzymaktivitet",{"$f":"IFERROR(VLOOKUP(Malt!$A3,BrewReport!$A$9:$D$18,4,FALSE),0)","v":0},{"$f":"F3*N5","v":0},{"$f":"F3*N7","v":0},{"$f":"F3*N7","v":0},{"$f":"F3*N7","v":0},{"$f":"F3*N5","v":0},null,null,16,null,{"$f":"IFERROR(INDEX($A$3:$A$75, SMALL(IF(ISBLANK(INDIRECT(CONCATENATE(\"$\",HLOOKUP(BrewReport!$F$7,$G$1:$K$2,2,FALSE),\"$3:$\",HLOOKUP(BrewReport!$F$7,$G$1:$K$2,2,FALSE),\"$80\"))), \"\", ROW(INDIRECT(CONCATENATE(\"$\",HLOOKUP(BrewReport!$F$7,$G$1:$K$2,2,FALSE),\"$3:$\",HLOOKUP(BrewReport!$F$7,$G$1:$K$2,2,FALSE),\"$80\")))-MIN(ROW(INDIRECT(CONCATENATE(\"$\",HLOOKUP(BrewReport!$F$7,$G$1:$K$2,2,FALSE),\"$3:$\",HLOOKUP(BrewReport!$F$7,$G$1:$K$2,2,FALSE),\"$80\"))))+1), ROW(A1))),\"\")","v":"Pilsner"}]
["Fuglsang Pilsner","3,7","3,7","320","Dansk, Høj enzymaktivitet",{"$f":"IFERROR(VLOOKUP(Malt!$A4,BrewReport!$A$9:$D$18,4,FALSE),0)","v":0},null,null,{"$f":"F4*N2","v":0},null,null,null,null,17,null,{"$f":"IFERROR(INDEX($A$3:$A$75, SMALL(IF(ISBLANK(INDIRECT(CONCATENATE(\"$\",HLOOKUP(BrewReport!$F$7,$G$1:$K$2,2,FALSE),\"$3:$\",HLOOKUP(BrewReport!$F$7,$G$1:$K$2,2,FALSE),\"$80\"))), \"\", ROW(INDIRECT(CONCATENATE(\"$\",HLOOKUP(BrewReport!$F$7,$G$1:$K$2,2,FALSE),\"$3:$\",HLOOKUP(BrewReport!$F$7,$G$1:$K$2,2,FALSE),\"$80\")))-MIN(ROW(INDIRECT(CONCATENATE(\"$\",HLOOKUP(BrewReport!$F$7,$G$1:$K$2,2,FALSE),\"$3:$\",HLOOKUP(BrewReport!$F$7,$G$1:$K$2,2,FALSE),\"$80\"))))+1), ROW(A2))),\"\")","v":"Vienna"}]
["Pilsner Bohemian","2,5 - 3,5",3,"300","Høj enzymaktivitet",{"$f":"IFERROR(VLOOKUP(Malt!$A5,BrewReport!$A$9:$D$18,4,FALSE),0)","v":0},{"$f":"F5*N5","v":0},null,{"$f":"F5*N3","v":0},{"$f":"F5*N7","v":0},null,null,"Grp 1 ",18,null,{"$f":"IFERROR(INDEX($A$3:$A$75, SMALL(IF(ISBLANK(INDIRECT(CONCATENATE(\"$\",HLOOKUP(BrewReport!$F$7,$G$1:$K$2,2,FALSE),\"$3:$\",HLOOKUP(BrewReport!$F$7,$G$1:$K$2,2,FALSE),\"$80\"))), \"\", ROW(INDIRECT(CONCATENATE(\"$\",HLOOKUP(BrewReport!$F$7,$G$1:$K$2,2,FALSE),\"$3:$\",HLOOKUP(BrewReport!$F$7,$G$1:$K$2,2,FALSE),\"$80\")))-MIN(ROW(INDIRECT(CONCATENATE(\"$\",HLOOKUP(BrewReport!$F$7,$G$1:$K$2,2,FALSE),\"$3:$\",HLOOKUP(BrewReport!$F$7,$G$1:$K$2,2,FALSE),\"$80\"))))+1), ROW(A3))),\"\")","v":"Pale Ale"}]
["Vienna","5 - 7","6","300","Farve, sødme og fylde",{"$f":"IFERROR(VLOOKUP(Malt!$A6,BrewReport!$A$9:$D$18,4,FALSE),0)","v":0},{"$f":"F6*N5","v":0},{"$f":"F6*N7","v":0},{"$f":"F6*N3","v":0},null,{"$f":"F6*N5","v":0},null,"Grp 2",19,null,{"$f":"IFERROR(INDEX($A$3:$A$75, SMALL(IF(ISBLANK(INDIRECT(CONCATENATE(\"$\",HLOOKUP(BrewReport!$F$7,$G$1:$K$2,2,FALSE),\"$3:$\",HLOOKUP(BrewReport!$F$7,$G$1:$K$2,2,FALSE),\"$80\"))), \"\", ROW(INDIRECT(CONCATENATE(\"$\",HLOOKUP(BrewReport!$F$7,$G$1:$K$2,2,FALSE),\"$3:$\",HLOOKUP(BrewReport!$F$7,$G$1:$K$2,2,FALSE),\"$80\")))-MIN(ROW(INDIRECT(CONCATENATE(\"$\",HLOOKUP(BrewReport!$F$7,$G$1:$K$2,2,FALSE),\"$3:$\",HLOOKUP(BrewReport!$F$7,$G$1:$K$2,2,FALSE),\"$80\"))))+1), ROW(A4))),\"\")","v":"Munich (Type 2)"}]
["Pale Ale","7,0 - 9,0",8,"300","Mørkere og mere maltet end Pilsner",{"$f":"IFERROR(VLOOKUP(Malt!$A7,BrewReport!$A$9:$D$18,4,FALSE),0)","v":3},{"$f":"F7*N7","v":60},{"$f":"F7*N7","v":60},{"$f":"F7*N3","v":48},{"$f":"F7*N6","v":57},{"$f":"F7*N5","v":54},null,"Grp 3",20,null,{"$f":"IFERROR(INDEX($A$3:$A$75, SMALL(IF(ISBLANK(INDIRECT(CONCATENATE(\"$\",HLOOKUP(BrewReport!$F$7,$G$1:$K$2,2,FALSE),\"$3:$\",HLOOKUP(BrewReport!$F$7,$G$1:$K$2,2,FALSE),\"$80\"))), \"\", ROW(INDIRECT(CONCATENATE(\"$\",HLOOKUP(BrewReport!$F$7,$G$1:$K$2,2,FALSE),\"$3:$\",HLOOKUP(BrewReport!$F$7,$G$1:$K$2,2,FALSE),\"$80\")))-MIN(ROW(INDIRECT(CONCATENATE(\"$\",HLOOKUP(BrewReport!$F$7,$G$1:$K$2,2,FALSE),\"$3:$\",HLOOKUP(BrewReport!$F$7,$G$1:$K$2,2,FALSE),\"$80\"))))+1), ROW(A5))),\"\")","v":"Munich Light (Type 1)"}]
["Munich (Type 2)","20 - 25","22,5","290","Sødme og fylde",{"$f":"IFERROR(VLOOKUP(Malt!$A8,BrewReport!$A$9:$D$18,4,FALSE),0)","v":0},{"$f":"F8*N5","v":0},{"$f":"F8*N7","v":0},{"$f":"F8*N7","v":0},{"$f":"F8*N16","v":0},{"$f":"F8*N5","v":0},null,"Grp 4",21,null,{"$f":"IFERROR(INDEX($A$3:$A$75, SMALL(IF(ISBLANK(INDIRECT(CONCATENATE(\"$\",HLOOKUP(BrewReport!$F$7,$G$1:$K$2,2,FALSE),\"$3:$\",HLOOKUP(BrewReport!$F$7,$G$1:$K$2,2,FALSE),\"$80\"))), \"\", ROW(INDIRECT(CONCATENATE(\"$\",HLOOKUP(BrewReport!$F$7,$G$1:$K$2,2,FALSE),\"$3:$\",HLOOKUP(BrewReport!$F$7,$G$1:$K$2,2,FALSE),\"$80\")))-MIN(ROW(INDIRECT(CONCATENATE(\"$\",HLOOKUP(BrewReport!$F$7,$G$1:$K$2,2,FALSE),\"$3:$\",HLOOKUP(BrewReport!$F$7,$G$1:$K$2,2,FALSE),\"$80\"))))+1), ROW(A6))),\"\")","v":"Maris Otter Ale"}]
["Munich Light (Type 1)","13 - 17","15","290","Sødme og fylde",{"$f":"IFERROR(VLOOKUP(Malt!$A9,BrewReport!$A$9:$D$18,4,FALSE),0)","v":0},{"$f":"F9*N5","v":0},{"$f":"F9*N7","v":0},{"$f":"F9*N7","v":0},{"$f":"F9*N16","v":0},{"$f":"F9*N5","v":0},null,"Grp 5",22,null,{"$f":"IFERROR(INDEX($A$3:$A$75, SMALL(IF(ISBLANK(INDIRECT(CONCATENATE(\"$\",HLOOKUP(BrewReport!$F$7,$G$1:$K$2,2,FALSE),\"$3:$\",HLOOKUP(BrewReport!$F$7,$G$1:$K$2,2,FALSE),\"$80\"))), \"\", ROW(INDIRECT(CONCATENATE(\"$\",HLOOKUP(BrewReport!$F$7,$G$1:$K$2,2,FALSE),\"$3:$\",HLOOKUP(BrewReport!$F$7,$G$1:$K$2,2,FALSE),\"$80\")))-MIN(ROW(INDIRECT(CONCATENATE(\"$\",HLOOKUP(BrewReport!$F$7,$G$1:$K$2,2,FALSE),\"$3:$\",HLOOKUP(BrewReport!$F$7,$G$1:$K$2,2,FALSE),\"$80\"))))+1), ROW(A7))),\"\")","v":"Cara Blond"}]
["Maris Otter Ale","5,5 - 8,0","6,75","320","Fyldig, nødder, let orange farve",{"$f":"IFERROR(VLOOKUP(Malt!$A10,BrewReport!$A$9:$D$18,4,FALSE),0)","v":0},{"$f":"F10*N6","v":0},{"$f":"F10*N7","v":0},null,null,{"$f":"F10*N12","v":0},null,"Grp 6",23,null,{"$f":"IFERROR(INDEX($A$3:$A$75, SMALL(IF(ISBLANK(INDIRECT(CONCATENATE(\"$\",HLOOKUP(BrewReport!$F$7,$G$1:$K$2,2,FALSE),\"$3:$\",HLOOKUP(BrewReport!$F$7,$G$1:$K$2,2,FALSE),\"$80\"))), \"\", ROW(INDIRECT(CONCATENATE(\"$\",HLOOKUP(BrewReport!$F$7,$G$1:$K$2,2,FALSE),\"$3:$\",HLOOKUP(BrewReport!$F$7,$G$1:$K$2,2,FALSE),\"$80\")))-MIN(ROW(INDIRECT(CONCATENATE(\"$\",HLOOKUP(BrewReport!$F$7,$G$1:$K$2,2,FALSE),\"$3:$\",HLOOKUP(BrewReport!$F$7,$G$1:$K$2,2,FALSE),\"$80\"))))+1), ROW(A8))),\"\")","v":"Cara Crystal (Gold)"}]
["Red X",30,30,"290","Fyldig, intens rødlig farve",{"$f":"IFERROR(VLOOKUP(Malt!$A11,BrewReport!$A$9:$D$18,4,FALSE),0)","v":0},{"$f":"F11*N6","v":0},null,null,null,null,null,"Grp 7",24,null,{"$f":"IFERROR(INDEX($A$3:$A$75, SMALL(IF(ISBLANK(INDIRECT(CONCATENATE(\"$\",HLOOKUP(BrewReport!$F$7,$G$1:$K$2,2,FALSE),\"$3:$\",HLOOKUP(BrewReport!$F$7,$G$1:$K$2,2,FALSE),\"$80\"))), \"\", ROW(INDIRECT(CONCATENATE(\"$\",HLOOKUP(BrewReport!$F$7,$G$1:$K$2,2,FALSE),\"$3:$\",HLOOKUP(BrewReport!$F$7,$G$1:$K$2,2,FALSE),\"$80\")))-MIN(ROW(INDIRECT(CONCATENATE(\"$\",HLOOKUP(BrewReport!$F$7,$G$1:$K$2,2,FALSE),\"$3:$\",HLOOKUP(BrewReport!$F$7,$G$1:$K$2,2,FALSE),\"$80\"))))+1), ROW(A9))),\"\")","v":"Cara Ruby"}]
["Karamel Malt",null,null,null,null,null,null,null,null,null,null,null,"Grp 8",25,null,{"$f":"IFERROR(INDEX($A$3:$A$75, SMALL(IF(ISBLANK(INDIRECT(CONCATENATE(\"$\",HLOOKUP(BrewReport!$F$7,$G$1:$K$2,2,FALSE),\"$3:$\",HLOOKUP(BrewReport!$F$7,$G$1:$K$2,2,FALSE),\"$80\"))), \"\", ROW(INDIRECT(CONCATENATE(\"$\",HLOOKUP(BrewReport!$F$7,$G$1:$K$2,2,FALSE),\"$3:$\",HLOOKUP(BrewReport!$F$7,$G$1:$K$2,2,FALSE),\"$80\")))-MIN(ROW(INDIRECT(CONCATENATE(\"$\",HLOOKUP(BrewReport!$F$7,$G$1:$K$2,2,FALSE),\"$3:$\",HLOOKUP(BrewReport!$F$7,$G$1:$K$2,2,FALSE),\"$80\"))))+1), ROW(A10))),\"\")","v":"Crystal"}]
["Cara Pils",5,5,"275",null,{"$f":"IFERROR(VLOOKUP(Malt!$A13,BrewReport!$A$9:$D$18,4,FALSE),0)","v":0},{"$f":"F13*N8","v":0},null,{"$f":"F13*N7","v":0},{"$f":"F13*N16","v":0},{"$f":"F13*N9","v":0},null,"Grp 9",26,null,{"$f":"IFERROR(INDEX($A$3:$A$75, SMALL(IF(ISBLANK(INDIRECT(CONCATENATE(\"$\",HLOOKUP(BrewReport!$F$7,$G$1:$K$2,2,FALSE),\"$3:$\",HLOOKUP(BrewReport!$F$7,$G$1:$K$2,2,FALSE),\"$80\"))), \"\", ROW(INDIRECT(CONCATENATE(\"$\",HLOOKUP(BrewReport!$F$7,$G$1:$K$2,2,FALSE),\"$3:$\",HLOOKUP(BrewReport!$F$7,$G$1:$K$2,2,FALSE),\"$80\")))-MIN(ROW(INDIRECT(CONCATENATE(\"$\",HLOOKUP(BrewReport!$F$7,$G$1:$K$2,2,FALSE),\"$3:$\",HLOOKUP(BrewReport!$F$7,$G$1:$K$2,2,FALSE),\"$80\"))))+1), ROW(A11))),\"\")","v":"Special B"}]
["Cara Blond","20 - 30","25","280","Mild karamel smag og gylden farve",{"$f":"IFERROR(VLOOKUP(Malt!$A14,BrewReport!$A$9:$D$18,4,FALSE),0)","v":0},{"$f":"F14*N8","v":0},{"$f":"F14*N16","v":0},null,{"$f":"F14*N16","v":0},{"$f":"F14*N9","v":0},null,"Grp 10",27,null,{"$f":"IFERROR(INDEX($A$3:$A$75, SMALL(IF(ISBLANK(INDIRECT(CONCATENATE(\"$\",HLOOKUP(BrewReport!$F$7,$G$1:$K$2,2,FALSE),\"$3:$\",HLOOKUP(BrewReport!$F$7,$G$1:$K$2,2,FALSE),\"$80\"))), \"\", ROW(INDIRECT(CONCATENATE(\"$\",HLOOKUP(BrewReport!$F$7,$G$1:$K$2,2,FALSE),\"$3:$\",HLOOKUP(BrewReport!$F$7,$G$1:$K$2,2,FALSE),\"$80\")))-MIN(ROW(INDIRECT(CONCATENATE(\"$\",HLOOKUP(BrewReport!$F$7,$G$1:$K$2,2,FALSE),\"$3:$\",HLOOKUP(BrewReport!$F$7,$G$1:$K$2,2,FALSE),\"$80\"))))+1), ROW(A12))),\"\")","v":"Coffee / Café Light"}]
["Carabelge","30 - 35","33","280",null,{"$f":"IFERROR(VLOOKUP(Malt!$A15,BrewReport!$A$9:$D$18,4,FALSE),0)","v":0},null,null,{"$f":"F15*N7","v":0},null,null,null,"Grp 11",28,null,{"$f":"IFERROR(INDEX($A$3:$A$75, SMALL(IF(ISBLANK(INDIRECT(CONCATENATE(\"$\",HLOOKUP(BrewReport!$F$7,$G$1:$K$2,2,FALSE),\"$3:$\",HLOOKUP(BrewReport!$F$7,$G$1:$K$2,2,FALSE),\"$80\"))), \"\", ROW(INDIRECT(CONCATENATE(\"$\",HLOOKUP(BrewReport!$F$7,$G$1:$K$2,2,FALSE),\"$3:$\",HLOOKUP(BrewReport!$F$7,$G$1:$K$2,2,FALSE),\"$80\")))-MIN(ROW(INDIRECT(CONCATENATE(\"$\",HLOOKUP(BrewReport!$F$7,$G$1:$K$2,2,FALSE),\"$3:$\",HLOOKUP(BrewReport!$F$7,$G$1:$K$2,2,FALSE),\"$80\"))))+1), ROW(A13))),\"\")","v":"Coffee / Café"}]
["Cara Vienna",50,50,"280",null,{"$f":"IFERROR(VLOOKUP(Malt!$A16,BrewReport!$A$9:$D$18,4,FALSE),0)","v":0},{"$f":"F16*N8","v":0},null,null,{"$f":"F16*N16","v":0},null,null,"Grp 12",30,null,{"$f":"IFERROR(INDEX($A$3:$A$75, SMALL(IF(ISBLANK(INDIRECT(CONCATENATE(\"$\",HLOOKUP(BrewReport!$F$7,$G$1:$K$2,2,FALSE),\"$3:$\",HLOOKUP(BrewReport!$F$7,$G$1:$K$2,2,FALSE),\"$80\"))), \"\", ROW(INDIRECT(CONCATENATE(\"$\",HLOOKUP(BrewReport!$F$7,$G$1:$K$2,2,FALSE),\"$3:$\",HLOOKUP(BrewReport!$F$7,$G$1:$K$2,2,FALSE),\"$80\")))-MIN(ROW(INDIRECT(CONCATENATE(\"$\",HLOOKUP(BrewReport!$F$7,$G$1:$K$2,2,FALSE),\"$3:$\",HLOOKUP(BrewReport!$F$7,$G$1:$K$2,2,FALSE),\"$80\"))))+1), ROW(A14))),\"\")","v":"Cara Clair"}]
["Cara Crystal (Gold)","110 - 130",120,"280","Stor karamel- og toffee smag, bedre skum og fylde",{"$f":"IFERROR(VLOOKUP(Malt!$A17,BrewReport!$A$9:$D$18,4,FALSE),0)","v":0},{"$f":"F17*N8","v":0},{"$f":"F17*N16","v":0},{"$f":"F17*N7","v":0},null,{"$f":"F17*N9","v":0},null,"Grp 13",40,null,{"$f":"IFERROR(INDEX($A$3:$A$75, SMALL(IF(ISBLANK(INDIRECT(CONCATENATE(\"$\",HLOOKUP(BrewReport!$F$7,$G$1:$K$2,2,FALSE),\"$3:$\",HLOOKUP(BrewReport!$F$7,$G$1:$K$2,2,FALSE),\"$80\"))), \"\", ROW(INDIRECT(CONCATENATE(\"$\",HLOOKUP(BrewReport!$F$7,$G$1:$K$2,2,FALSE),\"$3:$\",HLOOKUP(BrewReport!$F$7,$G$1:$K$2,2,FALSE),\"$80\")))-MIN(ROW(INDIRECT(CONCATENATE(\"$\",HLOOKUP(BrewReport!$F$7,$G$1:$K$2,2,FALSE),\"$3:$\",HLOOKUP(BrewReport!$F$7,$G$1:$K$2,2,FALSE),\"$80\"))))+1), ROW(A15))),\"\")","v":"Roasted Barley"}]
["Chateau Cara ",150,150,"280",null,{"$f":"IFERROR(VLOOKUP(Malt!$A18,BrewReport!$A$9:$D$18,4,FALSE),0)","v":0},null,null,{"$f":"F18*N7","v":0},null,{"$f":"F18*N9","v":0},null,null,null,null,{"$f":"IFERROR(INDEX($A$3:$A$75, SMALL(IF(ISBLANK(INDIRECT(CONCATENATE(\"$\",HLOOKUP(BrewReport!$F$7,$G$1:$K$2,2,FALSE),\"$3:$\",HLOOKUP(BrewReport!$F$7,$G$1:$K$2,2,FALSE),\"$80\"))), \"\", ROW(INDIRECT(CONCATENATE(\"$\",HLOOKUP(BrewReport!$F$7,$G$1:$K$2,2,FALSE),\"$3:$\",HLOOKUP(BrewReport!$F$7,$G$1:$K$2,2,FALSE),\"$80\")))-MIN(ROW(INDIRECT(CONCATENATE(\"$\",HLOOKUP(BrewReport!$F$7,$G$1:$K$2,2,FALSE),\"$3:$\",HLOOKUP(BrewReport!$F$7,$G$1:$K$2,2,FALSE),\"$80\"))))+1), ROW(A16))),\"\")","v":"Chocolate / carafa Type I"}]
["Cara Hell",25,25,"280",null,{"$f":"IFERROR(VLOOKUP(Malt!$A19,BrewReport!$A$9:$D$18,4,FALSE),0)","v":0},{"$f":"F19*N8","v":0},null,{"$f":"F19*N7","v":0},{"$f":"F19*N16","v":0},null,null,null,null,null,{"$f":"IFERROR(INDEX($A$3:$A$75, SMALL(IF(ISBLANK(INDIRECT(CONCATENATE(\"$\",HLOOKUP(BrewReport!$F$7,$G$1:$K$2,2,FALSE),\"$3:$\",HLOOKUP(BrewReport!$F$7,$G$1:$K$2,2,FALSE),\"$80\"))), \"\", ROW(INDIRECT(CONCATENATE(\"$\",HLOOKUP(BrewReport!$F$7,$G$1:$K$2,2,FALSE),\"$3:$\",HLOOKUP(BrewReport!$F$7,$G$1:$K$2,2,FALSE),\"$80\")))-MIN(ROW(INDIRECT(CONCATENATE(\"$\",HLOOKUP(BrewReport!$F$7,$G$1:$K$2,2,FALSE),\"$3:$\",HLOOKUP(BrewReport!$F$7,$G$1:$K$2,2,FALSE),\"$80\"))))+1), ROW(A17))),\"\")","v":"Black"}]
["Cara Munich Type I","80 - 100","90","275",null,{"$f":"IFERROR(VLOOKUP(Malt!$A20,BrewReport!$A$9:$D$18,4,FALSE),0)","v":0},{"$f":"F20*N7","v":0},null,{"$f":"F20*N7","v":0},{"$f":"F20*N15","v":0},null,null,null,null,null,{"$f":"IFERROR(INDEX($A$3:$A$75, SMALL(IF(ISBLANK(INDIRECT(CONCATENATE(\"$\",HLOOKUP(BrewReport!$F$7,$G$1:$K$2,2,FALSE),\"$3:$\",HLOOKUP(BrewReport!$F$7,$G$1:$K$2,2,FALSE),\"$80\"))), \"\", ROW(INDIRECT(CONCATENATE(\"$\",HLOOKUP(BrewReport!$F$7,$G$1:$K$2,2,FALSE),\"$3:$\",HLOOKUP(BrewReport!$F$7,$G$1:$K$2,2,FALSE),\"$80\")))-MIN(ROW(INDIRECT(CONCATENATE(\"$\",HLOOKUP(BrewReport!$F$7,$G$1:$K$2,2,FALSE),\"$3:$\",HLOOKUP(BrewReport!$F$7,$G$1:$K$2,2,FALSE),\"$80\"))))+1), ROW(A18))),\"\")","v":"Wheat"}]
["Cara Munich Type II","110 - 130","120","275",null,{"$f":"IFERROR(VLOOKUP(Malt!$A21,BrewReport!$A$9:$D$18,4,FALSE),0)","v":0},{"$f":"F21*N7","v":0},null,{"$f":"F21*N7","v":0},{"$f":"F21*N15","v":0},null,null,null,null,null,{"$f":"IFERROR(INDEX($A$3:$A$75, SMALL(IF(ISBLANK(INDIRECT(CONCATENATE(\"$\",HLOOKUP(BrewReport!$F$7,$G$1:$K$2,2,FALSE),\"$3:$\",HLOOKUP(BrewReport!$F$7,$G$1:$K$2,2,FALSE),\"$80\"))), \"\", ROW(INDIRECT(CONCATENATE(\"$\",HLOOKUP(BrewReport!$F$7,$G$1:$K$2,2,FALSE),\"$3:$\",HLOOKUP(BrewReport!$F$7,$G$1:$K$2,2,FALSE),\"$80\")))-MIN(ROW(INDIRECT(CONCATENATE(\"$\",HLOOKUP(BrewReport!$F$7,$G$1:$K$2,2,FALSE),\"$3:$\",HLOOKUP(BrewReport!$F$7,$G$1:$K$2,2,FALSE),\"$80\"))))+1), ROW(A19))),\"\")","v":"Wheat Munich"}]
["Cara Munich Type III","140 - 160","150","275",null,{"$f":"IFERROR(VLOOKUP(Malt!$A22,BrewReport!$A$9:$D$18,4,FALSE),0)","v":0},{"$f":"F22*N8","v":0},null,null,{"$f":"F22*N16","v":0},null,null,null,null,null,{"$f":"IFERROR(INDEX($A$3:$A$75, SMALL(IF(ISBLANK(INDIRECT(CONCATENATE(\"$\",HLOOKUP(BrewReport!$F$7,$G$1:$K$2,2,FALSE),\"$3:$\",HLOOKUP(BrewReport!$F$7,$G$1:$K$2,2,FALSE),\"$80\"))), \"\", ROW(INDIRECT(CONCATENATE(\"$\",HLOOKUP(BrewReport!$F$7,$G$1:$K$2,2,FALSE),\"$3:$\",HLOOKUP(BrewReport!$F$7,$G$1:$K$2,2,FALSE),\"$80\")))-MIN(ROW(INDIRECT(CONCATENATE(\"$\",HLOOKUP(BrewReport!$F$7,$G$1:$K$2,2,FALSE),\"$3:$\",HLOOKUP(BrewReport!$F$7,$G$1:$K$2,2,FALSE),\"$80\"))))+1), ROW(A20))),\"\")","v":"Wheat Spelt"}]
["Cara Red",40,40,"290",null,{"$f":"IFERROR(VLOOKUP(Malt!$A23,BrewReport!$A$9:$D$18,4,FALSE),0)","v":0},{"$f":"F23*N8","v":0},null,{"$f":"F23*N7","v":0},{"$f":"F23*N16","v":0},null,null,null,null,null,{"$f":"IFERROR(INDEX($A$3:$A$75, SMALL(IF(ISBLANK(INDIRECT(CONCATENATE(\"$\",HLOOKUP(BrewReport!$F$7,$G$1:$K$2,2,FALSE),\"$3:$\",HLOOKUP(BrewReport!$F$7,$G$1:$K$2,2,FALSE),\"$80\"))), \"\", ROW(INDIRECT(CONCATENATE(\"$\",HLOOKUP(BrewReport!$F$7,$G$1:$K$2,2,FALSE),\"$3:$\",HLOOKUP(BrewReport!$F$7,$G$1:$K$2,2,FALSE),\"$80\")))-MIN(ROW(INDIRECT(CONCATENATE(\"$\",HLOOKUP(BrewReport!$F$7,$G$1:$K$2,2,FALSE),\"$3:$\",HLOOKUP(BrewReport!$F$7,$G$1:$K$2,2,FALSE),\"$80\"))))+1), ROW(A21))),\"\")","v":"Biscuit"}]
["Cara Aroma","350 - 450","400","290",null,{"$f":"IFERROR(VLOOKUP(Malt!$A24,BrewReport!$A$9:$D$18,4,FALSE),0)","v":0},{"$f":"F24*N9","v":0},null,null,{"$f":"F24*N16","v":0},null,null,null,null,null,{"$f":"IFERROR(INDEX($A$3:$A$75, SMALL(IF(ISBLANK(INDIRECT(CONCATENATE(\"$\",HLOOKUP(BrewReport!$F$7,$G$1:$K$2,2,FALSE),\"$3:$\",HLOOKUP(BrewReport!$F$7,$G$1:$K$2,2,FALSE),\"$80\"))), \"\", ROW(INDIRECT(CONCATENATE(\"$\",HLOOKUP(BrewReport!$F$7,$G$1:$K$2,2,FALSE),\"$3:$\",HLOOKUP(BrewReport!$F$7,$G$1:$K$2,2,FALSE),\"$80\")))-MIN(ROW(INDIRECT(CONCATENATE(\"$\",HLOOKUP(BrewReport!$F$7,$G$1:$K$2,2,FALSE),\"$3:$\",HLOOKUP(BrewReport!$F$7,$G$1:$K$2,2,FALSE),\"$80\"))))+1), ROW(A22))),\"\")","v":"Arome"}]
["Cara Amber",60,60,"290",null,{"$f":"IFERROR(VLOOKUP(Malt!$A25,BrewReport!$A$9:$D$18,4,FALSE),0)","v":0},{"$f":"F25*N9","v":0},null,null,{"$f":"F25*N16","v":0},null,null,null,null,null,{"$f":"IFERROR(INDEX($A$3:$A$75, SMALL(IF(ISBLANK(INDIRECT(CONCATENATE(\"$\",HLOOKUP(BrewReport!$F$7,$G$1:$K$2,2,FALSE),\"$3:$\",HLOOKUP(BrewReport!$F$7,$G$1:$K$2,2,FALSE),\"$80\"))), \"\", ROW(INDIRECT(CONCATENATE(\"$\",HLOOKUP(BrewReport!$F$7,$G$1:$K$2,2,FALSE),\"$3:$\",HLOOKUP(BrewReport!$F$7,$G$1:$K$2,2,FALSE),\"$80\")))-MIN(ROW(INDIRECT(CONCATENATE(\"$\",HLOOKUP(BrewReport!$F$7,$G$1:$K$2,2,FALSE),\"$3:$\",HLOOKUP(BrewReport!$F$7,$G$1:$K$2,2,FALSE),\"$80\"))))+1), ROW(A23))),\"\")","v":"Melano Light"}]
["Cara Rye",90,90,"260",null,{"$f":"IFERROR(VLOOKUP(Malt!$A26,BrewReport!$A$9:$D$18,4,FALSE),0)","v":0},{"$f":"F26*N9","v":0},null,null,null,null,null,null,null,null,{"$f":"IFERROR(INDEX($A$3:$A$75, SMALL(IF(ISBLANK(INDIRECT(CONCATENATE(\"$\",HLOOKUP(BrewReport!$F$7,$G$1:$K$2,2,FALSE),\"$3:$\",HLOOKUP(BrewReport!$F$7,$G$1:$K$2,2,FALSE),\"$80\"))), \"\", ROW(INDIRECT(CONCATENATE(\"$\",HLOOKUP(BrewReport!$F$7,$G$1:$K$2,2,FALSE),\"$3:$\",HLOOKUP(BrewReport!$F$7,$G$1:$K$2,2,FALSE),\"$80\")))-MIN(ROW(INDIRECT(CONCATENATE(\"$\",HLOOKUP(BrewReport!$F$7,$G$1:$K$2,2,FALSE),\"$3:$\",HLOOKUP(BrewReport!$F$7,$G$1:$K$2,2,FALSE),\"$80\"))))+1), ROW(A24))),\"\")","v":"Melano"}]
["Cara Ruby",50,50,"290","Rig karamelsmag og toffee aroma",{"$f":"IFERROR(VLOOKUP(Malt!$A27,BrewReport!$A$9:$D$18,4,FALSE),0)","v":0},null,{"$f":"F27*N16","v":0},{"$f":"F27*N3","v":0},null,{"$f":"F27*N9","v":0},null,null,null,null,{"$f":"IFERROR(INDEX($A$3:$A$75, SMALL(IF(ISBLANK(INDIRECT(CONCATENATE(\"$\",HLOOKUP(BrewReport!$F$7,$G$1:$K$2,2,FALSE),\"$3:$\",HLOOKUP(BrewReport!$F$7,$G$1:$K$2,2,FALSE),\"$80\"))), \"\", ROW(INDIRECT(CONCATENATE(\"$\",HLOOKUP(BrewReport!$F$7,$G$1:$K$2,2,FALSE),\"$3:$\",HLOOKUP(BrewReport!$F$7,$G$1:$K$2,2,FALSE),\"$80\")))-MIN(ROW(INDIRECT(CONCATENATE(\"$\",HLOOKUP(BrewReport!$F$7,$G$1:$K$2,2,FALSE),\"$3:$\",HLOOKUP(BrewReport!$F$7,$G$1:$K$2,2,FALSE),\"$80\"))))+1), ROW(A25))),\"\")","v":"Boghvede / Buckwheat"}]
["Cara Wheat","100 - 140",120,"290",null,{"$f":"IFERROR(VLOOKUP(Malt!$A28,BrewReport!$A$9:$D$18,4,FALSE),0)","v":0},{"$f":"F28*N9","v":0},null,null,null,null,null,null,null,null,{"$f":"IFERROR(INDEX($A$3:$A$75, SMALL(IF(ISBLANK(INDIRECT(CONCATENATE(\"$\",HLOOKUP(BrewReport!$F$7,$G$1:$K$2,2,FALSE),\"$3:$\",HLOOKUP(BrewReport!$F$7,$G$1:$K$2,2,FALSE),\"$80\"))), \"\", ROW(INDIRECT(CONCATENATE(\"$\",HLOOKUP(BrewReport!$F$7,$G$1:$K$2,2,FALSE),\"$3:$\",HLOOKUP(BrewReport!$F$7,$G$1:$K$2,2,FALSE),\"$80\")))-MIN(ROW(INDIRECT(CONCATENATE(\"$\",HLOOKUP(BrewReport!$F$7,$G$1:$K$2,2,FALSE),\"$3:$\",HLOOKUP(BrewReport!$F$7,$G$1:$K$2,2,FALSE),\"$80\"))))+1), ROW(A26))),\"\")","v":"Sauer / Acid"}]
["Crystal",150,150,"280","Rig malt smag og aroma. Blød bitterhed",{"$f":"IFERROR(VLOOKUP(Malt!$A29,BrewReport!$A$9:$D$18,4,FALSE),0)","v":0},null,{"$f":"F29*N16","v":0},null,null,null,null,null,null,null,{"$f":"IFERROR(INDEX($A$3:$A$75, SMALL(IF(ISBLANK(INDIRECT(CONCATENATE(\"$\",HLOOKUP(BrewReport!$F$7,$G$1:$K$2,2,FALSE),\"$3:$\",HLOOKUP(BrewReport!$F$7,$G$1:$K$2,2,FALSE),\"$80\"))), \"\", ROW(INDIRECT(CONCATENATE(\"$\",HLOOKUP(BrewReport!$F$7,$G$1:$K$2,2,FALSE),\"$3:$\",HLOOKUP(BrewReport!$F$7,$G$1:$K$2,2,FALSE),\"$80\")))-MIN(ROW(INDIRECT(CONCATENATE(\"$\",HLOOKUP(BrewReport!$F$7,$G$1:$K$2,2,FALSE),\"$3:$\",HLOOKUP(BrewReport!$F$7,$G$1:$K$2,2,FALSE),\"$80\"))))+1), ROW(A27))),\"\")","v":"Abbey"}]
["Special B",300,300,"250","Rosinagtig smag, strejf af nødder og blommer",{"$f":"IFERROR(VLOOKUP(Malt!$A30,BrewReport!$A$9:$D$18,4,FALSE),0)","v":0},{"$f":"F30*N9","v":0},{"$f":"F30*N16","v":0},{"$f":"F30*N7","v":0},{"$f":"F30*N16","v":0},null,null,null,null,null,{"$f":"IFERROR(INDEX($A$3:$A$75, SMALL(IF(ISBLANK(INDIRECT(CONCATENATE(\"$\",HLOOKUP(BrewReport!$F$7,$G$1:$K$2,2,FALSE),\"$3:$\",HLOOKUP(BrewReport!$F$7,$G$1:$K$2,2,FALSE),\"$80\"))), \"\", ROW(INDIRECT(CONCATENATE(\"$\",HLOOKUP(BrewReport!$F$7,$G$1:$K$2,2,FALSE),\"$3:$\",HLOOKUP(BrewReport!$F$7,$G$1:$K$2,2,FALSE),\"$80\")))-MIN(ROW(INDIRECT(CONCATENATE(\"$\",HLOOKUP(BrewReport!$F$7,$G$1:$K$2,2,FALSE),\"$3:$\",HLOOKUP(BrewReport!$F$7,$G$1:$K$2,2,FALSE),\"$80\"))))+1), ROW(A28))),\"\")","v":"Peated / Røg"}]
["Coffee / Café Light","250","250","280","Mild nøddeagtig og kaffesmag",{"$f":"IFERROR(VLOOKUP(Malt!$A31,BrewReport!$A$9:$D$18,4,FALSE),0)","v":0},{"$f":"F31*N10","v":0},{"$f":"F31*N16","v":0},null,null,{"$f":"F31*N10","v":0},null,null,null,null,{"$f":"IFERROR(INDEX($A$3:$A$75, SMALL(IF(ISBLANK(INDIRECT(CONCATENATE(\"$\",HLOOKUP(BrewReport!$F$7,$G$1:$K$2,2,FALSE),\"$3:$\",HLOOKUP(BrewReport!$F$7,$G$1:$K$2,2,FALSE),\"$80\"))), \"\", ROW(INDIRECT(CONCATENATE(\"$\",HLOOKUP(BrewReport!$F$7,$G$1:$K$2,2,FALSE),\"$3:$\",HLOOKUP(BrewReport!$F$7,$G$1:$K$2,2,FALSE),\"$80\")))-MIN(ROW(INDIRECT(CONCATENATE(\"$\",HLOOKUP(BrewReport!$F$7,$G$1:$K$2,2,FALSE),\"$3:$\",HLOOKUP(BrewReport!$F$7,$G$1:$K$2,2,FALSE),\"$80\"))))+1), ROW(A29))),\"\")","v":"Oat"}]
["Coffee / Café",500,500,"280","Mild nøddeagtig og kaffesmag",{"$f":"IFERROR(VLOOKUP(Malt!$A32,BrewReport!$A$9:$D$18,4,FALSE),0)","v":0},{"$f":"F32*N10","v":0},{"$f":"F32*N16","v":0},null,null,{"$f":"F32*N10","v":0},null,null,null,null,{"$f":"IFERROR(INDEX($A$3:$A$75, SMALL(IF(ISBLANK(INDIRECT(CONCATENATE(\"$\",HLOOKUP(BrewReport!$F$7,$G$1:$K$2,2,FALSE),\"$3:$\",HLOOKUP(BrewReport!$F$7,$G$1:$K$2,2,FALSE),\"$80\"))), \"\", ROW(INDIRECT(CONCATENATE(\"$\",HLOOKUP(BrewReport!$F$7,$G$1:$K$2,2,FALSE),\"$3:$\",HLOOKUP(BrewReport!$F$7,$G$1:$K$2,2,FALSE),\"$80\")))-MIN(ROW(INDIRECT(CONCATENATE(\"$\",HLOOKUP(BrewReport!$F$7,$G$1:$K$2,2,FALSE),\"$3:$\",HLOOKUP(BrewReport!$F$7,$G$1:$K$2,2,FALSE),\"$80\"))))+1), ROW(A30))),\"\")","v":"Rye"}]
["Cara Clair","8","8","275",null,{"$f":"IFERROR(VLOOKUP(Malt!$A33,BrewReport!$A$9:$D$18,4,FALSE),0)","v":0},{"$f":"F33*N8","v":0},{"$f":"F33*N8","v":0},null,null,null,null,null,null,null,{"$f":"IFERROR(INDEX($A$3:$A$75, SMALL(IF(ISBLANK(INDIRECT(CONCATENATE(\"$\",HLOOKUP(BrewReport!$F$7,$G$1:$K$2,2,FALSE),\"$3:$\",HLOOKUP(BrewReport!$F$7,$G$1:$K$2,2,FALSE),\"$80\"))), \"\", ROW(INDIRECT(CONCATENATE(\"$\",HLOOKUP(BrewReport!$F$7,$G$1:$K$2,2,FALSE),\"$3:$\",HLOOKUP(BrewReport!$F$7,$G$1:$K$2,2,FALSE),\"$80\")))-MIN(ROW(INDIRECT(CONCATENATE(\"$\",HLOOKUP(BrewReport!$F$7,$G$1:$K$2,2,FALSE),\"$3:$\",HLOOKUP(BrewReport!$F$7,$G$1:$K$2,2,FALSE),\"$80\"))))+1), ROW(A31))),\"\")","v":"Barley Flaked"}]
["Ristet Malt",null,null,null,null,null,null,null,null,null,null,null,null,null,null,{"$f":"IFERROR(INDEX($A$3:$A$75, SMALL(IF(ISBLANK(INDIRECT(CONCATENATE(\"$\",HLOOKUP(BrewReport!$F$7,$G$1:$K$2,2,FALSE),\"$3:$\",HLOOKUP(BrewReport!$F$7,$G$1:$K$2,2,FALSE),\"$80\"))), \"\", ROW(INDIRECT(CONCATENATE(\"$\",HLOOKUP(BrewReport!$F$7,$G$1:$K$2,2,FALSE),\"$3:$\",HLOOKUP(BrewReport!$F$7,$G$1:$K$2,2,FALSE),\"$80\")))-MIN(ROW(INDIRECT(CONCATENATE(\"$\",HLOOKUP(BrewReport!$F$7,$G$1:$K$2,2,FALSE),\"$3:$\",HLOOKUP(BrewReport!$F$7,$G$1:$K$2,2,FALSE),\"$80\"))))+1), ROW(A32))),\"\")","v":"Torrefied Maize Flaked"}]
["Roasted Barley","1200 - 1400",1300,"210","Kaffeagtig smag, kraftigt ristet smag. Sødme",{"$f":"IFERROR(VLOOKUP(Malt!$A35,BrewReport!$A$9:$D$18,4,FALSE),0)","v":0},{"$f":"F35*N10","v":0},{"$f":"F35*N16","v":0},null,{"$f":"F35*N15","v":0},{"$f":"F35*N7","v":0},null,null,null,null,{"$f":"IFERROR(INDEX($A$3:$A$75, SMALL(IF(ISBLANK(INDIRECT(CONCATENATE(\"$\",HLOOKUP(BrewReport!$F$7,$G$1:$K$2,2,FALSE),\"$3:$\",HLOOKUP(BrewReport!$F$7,$G$1:$K$2,2,FALSE),\"$80\"))), \"\", ROW(INDIRECT(CONCATENATE(\"$\",HLOOKUP(BrewReport!$F$7,$G$1:$K$2,2,FALSE),\"$3:$\",HLOOKUP(BrewReport!$F$7,$G$1:$K$2,2,FALSE),\"$80\")))-MIN(ROW(INDIRECT(CONCATENATE(\"$\",HLOOKUP(BrewReport!$F$7,$G$1:$K$2,2,FALSE),\"$3:$\",HLOOKUP(BrewReport!$F$7,$G$1:$K$2,2,FALSE),\"$80\"))))+1), ROW(A33))),\"\")","v":"Torrefied Oat Flakes"}]
["Roasted Wheat","950 - 1050","1000","210",null,{"$f":"IFERROR(VLOOKUP(Malt!$A36,BrewReport!$A$9:$D$18,4,FALSE),0)","v":0},{"$f":"F36*N10","v":0},null,null,{"$f":"F36*N15","v":0},null,null,null,null,null,{"$f":"IFERROR(INDEX($A$3:$A$75, SMALL(IF(ISBLANK(INDIRECT(CONCATENATE(\"$\",HLOOKUP(BrewReport!$F$7,$G$1:$K$2,2,FALSE),\"$3:$\",HLOOKUP(BrewReport!$F$7,$G$1:$K$2,2,FALSE),\"$80\"))), \"\", ROW(INDIRECT(CONCATENATE(\"$\",HLOOKUP(BrewReport!$F$7,$G$1:$K$2,2,FALSE),\"$3:$\",HLOOKUP(BrewReport!$F$7,$G$1:$K$2,2,FALSE),\"$80\")))-MIN(ROW(INDIRECT(CONCATENATE(\"$\",HLOOKUP(BrewReport!$F$7,$G$1:$K$2,2,FALSE),\"$3:$\",HLOOKUP(BrewReport!$F$7,$G$1:$K$2,2,FALSE),\"$80\"))))+1), ROW(A34))),\"\")","v":"Wheat Flaked"}]
["Roasted Rye","500 - 800","650","260",null,{"$f":"IFERROR(VLOOKUP(Malt!$A37,BrewReport!$A$9:$D$18,4,FALSE),0)","v":0},{"$f":"F37*N10","v":0},null,{"$f":"F37*N4","v":0},null,null,null,null,null,null,{"$f":"IFERROR(INDEX($A$3:$A$75, SMALL(IF(ISBLANK(INDIRECT(CONCATENATE(\"$\",HLOOKUP(BrewReport!$F$7,$G$1:$K$2,2,FALSE),\"$3:$\",HLOOKUP(BrewReport!$F$7,$G$1:$K$2,2,FALSE),\"$80\"))), \"\", ROW(INDIRECT(CONCATENATE(\"$\",HLOOKUP(BrewReport!$F$7,$G$1:$K$2,2,FALSE),\"$3:$\",HLOOKUP(BrewReport!$F$7,$G$1:$K$2,2,FALSE),\"$80\")))-MIN(ROW(INDIRECT(CONCATENATE(\"$\",HLOOKUP(BrewReport!$F$7,$G$1:$K$2,2,FALSE),\"$3:$\",HLOOKUP(BrewReport!$F$7,$G$1:$K$2,2,FALSE),\"$80\"))))+1), ROW(A35))),\"\")","v":"Torrefied Rice Flaked"}]
["Chocolate Rye",800,800,"260",null,{"$f":"IFERROR(VLOOKUP(Malt!$A38,BrewReport!$A$9:$D$18,4,FALSE),0)","v":0},null,null,{"$f":"F38*N7","v":0},null,null,null,null,null,null,{"$f":"IFERROR(INDEX($A$3:$A$75, SMALL(IF(ISBLANK(INDIRECT(CONCATENATE(\"$\",HLOOKUP(BrewReport!$F$7,$G$1:$K$2,2,FALSE),\"$3:$\",HLOOKUP(BrewReport!$F$7,$G$1:$K$2,2,FALSE),\"$80\"))), \"\", ROW(INDIRECT(CONCATENATE(\"$\",HLOOKUP(BrewReport!$F$7,$G$1:$K$2,2,FALSE),\"$3:$\",HLOOKUP(BrewReport!$F$7,$G$1:$K$2,2,FALSE),\"$80\")))-MIN(ROW(INDIRECT(CONCATENATE(\"$\",HLOOKUP(BrewReport!$F$7,$G$1:$K$2,2,FALSE),\"$3:$\",HLOOKUP(BrewReport!$F$7,$G$1:$K$2,2,FALSE),\"$80\"))))+1), ROW(A36))),\"\")","v":"Whisky            30 - 45 ppm"}]
["Chocolate / carafa Type I","800 - 900","900","275","Nøddeagtig og ristet smag",{"$f":"IFERROR(VLOOKUP(Malt!$A39,BrewReport!$A$9:$D$18,4,FALSE),0)","v":0},{"$f":"F39*N10","v":0},{"$f":"F39*N16","v":0},{"$f":"F39*N7","v":0},{"$f":"F39*N16","v":0},{"$f":"F39*N9","v":0},null,null,null,null,{"$f":"IFERROR(INDEX($A$3:$A$75, SMALL(IF(ISBLANK(INDIRECT(CONCATENATE(\"$\",HLOOKUP(BrewReport!$F$7,$G$1:$K$2,2,FALSE),\"$3:$\",HLOOKUP(BrewReport!$F$7,$G$1:$K$2,2,FALSE),\"$80\"))), \"\", ROW(INDIRECT(CONCATENATE(\"$\",HLOOKUP(BrewReport!$F$7,$G$1:$K$2,2,FALSE),\"$3:$\",HLOOKUP(BrewReport!$F$7,$G$1:$K$2,2,FALSE),\"$80\")))-MIN(ROW(INDIRECT(CONCATENATE(\"$\",HLOOKUP(BrewReport!$F$7,$G$1:$K$2,2,FALSE),\"$3:$\",HLOOKUP(BrewReport!$F$7,$G$1:$K$2,2,FALSE),\"$80\"))))+1), ROW(A37))),\"\")","v":"Whisky Light    15 - 25 ppm"}]
["Dehusked Chocolate","800",800,"275",null,{"$f":"IFERROR(VLOOKUP(Malt!$A40,BrewReport!$A$9:$D$18,4,FALSE),0)","v":0},{"$f":"F40*N10","v":0},null,null,null,null,null,null,null,null,{"$f":"IFERROR(INDEX($A$3:$A$75, SMALL(IF(ISBLANK(INDIRECT(CONCATENATE(\"$\",HLOOKUP(BrewReport!$F$7,$G$1:$K$2,2,FALSE),\"$3:$\",HLOOKUP(BrewReport!$F$7,$G$1:$K$2,2,FALSE),\"$80\"))), \"\", ROW(INDIRECT(CONCATENATE(\"$\",HLOOKUP(BrewReport!$F$7,$G$1:$K$2,2,FALSE),\"$3:$\",HLOOKUP(BrewReport!$F$7,$G$1:$K$2,2,FALSE),\"$80\")))-MIN(ROW(INDIRECT(CONCATENATE(\"$\",HLOOKUP(BrewReport!$F$7,$G$1:$K$2,2,FALSE),\"$3:$\",HLOOKUP(BrewReport!$F$7,$G$1:$K$2,2,FALSE),\"$80\"))))+1), ROW(A38))),\"\")","v":""}]
["Black","1500","1500","210","Let brændt smag",{"$f":"IFERROR(VLOOKUP(Malt!$A41,BrewReport!$A$9:$D$18,4,FALSE),0)","v":0},{"$f":"F41*N10","v":0},{"$f":"F41*N16","v":0},{"$f":"F41*N7","v":0},{"$f":"F41*N16","v":0},{"$f":"F41*N10","v":0},null,null,null,null,{"$f":"IFERROR(INDEX($A$3:$A$75, SMALL(IF(ISBLANK(INDIRECT(CONCATENATE(\"$\",HLOOKUP(BrewReport!$F$7,$G$1:$K$2,2,FALSE),\"$3:$\",HLOOKUP(BrewReport!$F$7,$G$1:$K$2,2,FALSE),\"$80\"))), \"\", ROW(INDIRECT(CONCATENATE(\"$\",HLOOKUP(BrewReport!$F$7,$G$1:$K$2,2,FALSE),\"$3:$\",HLOOKUP(BrewReport!$F$7,$G$1:$K$2,2,FALSE),\"$80\")))-MIN(ROW(INDIRECT(CONCATENATE(\"$\",HLOOKUP(BrewReport!$F$7,$G$1:$K$2,2,FALSE),\"$3:$\",HLOOKUP(BrewReport!$F$7,$G$1:$K$2,2,FALSE),\"$80\"))))+1), ROW(A39))),\"\")","v":""}]
["Dehusked Black / carafa Special type II",1400,1400,"210",null,{"$f":"IFERROR(VLOOKUP(Malt!$A42,BrewReport!$A$9:$D$18,4,FALSE),0)","v":0},{"$f":"F42*N10","v":0},null,null,{"$f":"F42*N16","v":0},null,null,null,null,null,{"$f":"IFERROR(INDEX($A$3:$A$75, SMALL(IF(ISBLANK(INDIRECT(CONCATENATE(\"$\",HLOOKUP(BrewReport!$F$7,$G$1:$K$2,2,FALSE),\"$3:$\",HLOOKUP(BrewReport!$F$7,$G$1:$K$2,2,FALSE),\"$80\"))), \"\", ROW(INDIRECT(CONCATENATE(\"$\",HLOOKUP(BrewReport!$F$7,$G$1:$K$2,2,FALSE),\"$3:$\",HLOOKUP(BrewReport!$F$7,$G$1:$K$2,2,FALSE),\"$80\")))-MIN(ROW(INDIRECT(CONCATENATE(\"$\",HLOOKUP(BrewReport!$F$7,$G$1:$K$2,2,FALSE),\"$3:$\",HLOOKUP(BrewReport!$F$7,$G$1:$K$2,2,FALSE),\"$80\"))))+1), ROW(A40))),\"\")","v":""}]
["Wheat Chocolate","900 - 1200","1050","275",null,{"$f":"IFERROR(VLOOKUP(Malt!$A43,BrewReport!$A$9:$D$18,4,FALSE),0)","v":0},{"$f":"F43*N10","v":0},null,{"$f":"F43*N7","v":0},{"$f":"F43*N16","v":0},null,null,null,null,null,{"$f":"IFERROR(INDEX($A$3:$A$75, SMALL(IF(ISBLANK(INDIRECT(CONCATENATE(\"$\",HLOOKUP(BrewReport!$F$7,$G$1:$K$2,2,FALSE),\"$3:$\",HLOOKUP(BrewReport!$F$7,$G$1:$K$2,2,FALSE),\"$80\"))), \"\", ROW(INDIRECT(CONCATENATE(\"$\",HLOOKUP(BrewReport!$F$7,$G$1:$K$2,2,FALSE),\"$3:$\",HLOOKUP(BrewReport!$F$7,$G$1:$K$2,2,FALSE),\"$80\")))-MIN(ROW(INDIRECT(CONCATENATE(\"$\",HLOOKUP(BrewReport!$F$7,$G$1:$K$2,2,FALSE),\"$3:$\",HLOOKUP(BrewReport!$F$7,$G$1:$K$2,2,FALSE),\"$80\"))))+1), ROW(A41))),\"\")","v":""}]
["Chocolate Spelt","450 - 650",550,"250",null,{"$f":"IFERROR(VLOOKUP(Malt!$A44,BrewReport!$A$9:$D$18,4,FALSE),0)","v":0},null,null,{"$f":"F44*N16","v":0},null,null,null,null,null,null,{"$f":"IFERROR(INDEX($A$3:$A$75, SMALL(IF(ISBLANK(INDIRECT(CONCATENATE(\"$\",HLOOKUP(BrewReport!$F$7,$G$1:$K$2,2,FALSE),\"$3:$\",HLOOKUP(BrewReport!$F$7,$G$1:$K$2,2,FALSE),\"$80\"))), \"\", ROW(INDIRECT(CONCATENATE(\"$\",HLOOKUP(BrewReport!$F$7,$G$1:$K$2,2,FALSE),\"$3:$\",HLOOKUP(BrewReport!$F$7,$G$1:$K$2,2,FALSE),\"$80\")))-MIN(ROW(INDIRECT(CONCATENATE(\"$\",HLOOKUP(BrewReport!$F$7,$G$1:$K$2,2,FALSE),\"$3:$\",HLOOKUP(BrewReport!$F$7,$G$1:$K$2,2,FALSE),\"$80\"))))+1), ROW(A42))),\"\")","v":""}]
["Black of Black","400 - 600",500,"250",null,{"$f":"IFERROR(VLOOKUP(Malt!$A45,BrewReport!$A$9:$D$18,4,FALSE),0)","v":0},{"$f":"F45*N10","v":0},null,null,null,{"$f":"F45*N10","v":0},null,null,null,null,{"$f":"IFERROR(INDEX($A$3:$A$75, SMALL(IF(ISBLANK(INDIRECT(CONCATENATE(\"$\",HLOOKUP(BrewReport!$F$7,$G$1:$K$2,2,FALSE),\"$3:$\",HLOOKUP(BrewReport!$F$7,$G$1:$K$2,2,FALSE),\"$80\"))), \"\", ROW(INDIRECT(CONCATENATE(\"$\",HLOOKUP(BrewReport!$F$7,$G$1:$K$2,2,FALSE),\"$3:$\",HLOOKUP(BrewReport!$F$7,$G$1:$K$2,2,FALSE),\"$80\")))-MIN(ROW(INDIRECT(CONCATENATE(\"$\",HLOOKUP(BrewReport!$F$7,$G$1:$K$2,2,FALSE),\"$3:$\",HLOOKUP(BrewReport!$F$7,$G$1:$K$2,2,FALSE),\"$80\"))))+1), ROW(A43))),\"\")","v":""}]
["Hvede Malt",null,null,null,null,null,null,null,null,null,null,null,null,null,null,{"$f":"IFERROR(INDEX($A$3:$A$75, SMALL(IF(ISBLANK(INDIRECT(CONCATENATE(\"$\",HLOOKUP(BrewReport!$F$7,$G$1:$K$2,2,FALSE),\"$3:$\",HLOOKUP(BrewReport!$F$7,$G$1:$K$2,2,FALSE),\"$80\"))), \"\", ROW(INDIRECT(CONCATENATE(\"$\",HLOOKUP(BrewReport!$F$7,$G$1:$K$2,2,FALSE),\"$3:$\",HLOOKUP(BrewReport!$F$7,$G$1:$K$2,2,FALSE),\"$80\")))-MIN(ROW(INDIRECT(CONCATENATE(\"$\",HLOOKUP(BrewReport!$F$7,$G$1:$K$2,2,FALSE),\"$3:$\",HLOOKUP(BrewReport!$F$7,$G$1:$K$2,2,FALSE),\"$80\"))))+1), ROW(A44))),\"\")","v":""}]
["Wheat",3,3,"310","Fylde og skumstabilitet",{"$f":"IFERROR(VLOOKUP(Malt!$A47,BrewReport!$A$9:$D$18,4,FALSE),0)","v":2.5},{"$f":"F47*N5","v":45},{"$f":"F47*N7","v":50},null,{"$f":"F47*N16","v":75},{"$f":"F47*N5","v":45},null,null,null,null,{"$f":"IFERROR(INDEX($A$3:$A$75, SMALL(IF(ISBLANK(INDIRECT(CONCATENATE(\"$\",HLOOKUP(BrewReport!$F$7,$G$1:$K$2,2,FALSE),\"$3:$\",HLOOKUP(BrewReport!$F$7,$G$1:$K$2,2,FALSE),\"$80\"))), \"\", ROW(INDIRECT(CONCATENATE(\"$\",HLOOKUP(BrewReport!$F$7,$G$1:$K$2,2,FALSE),\"$3:$\",HLOOKUP(BrewReport!$F$7,$G$1:$K$2,2,FALSE),\"$80\")))-MIN(ROW(INDIRECT(CONCATENATE(\"$\",HLOOKUP(BrewReport!$F$7,$G$1:$K$2,2,FALSE),\"$3:$\",HLOOKUP(BrewReport!$F$7,$G$1:$K$2,2,FALSE),\"$80\"))))+1), ROW(A45))),\"\")","v":""}]
["CaraWheat","3 - 5","4","310",null,{"$f":"IFERROR(VLOOKUP(Malt!$A48,BrewReport!$A$9:$D$18,4,FALSE),0)","v":0},{"$f":"F48*N6","v":0},null,null,{"$f":"F48*N15","v":0},null,null,null,null,null,{"$f":"IFERROR(INDEX($A$3:$A$75, SMALL(IF(ISBLANK(INDIRECT(CONCATENATE(\"$\",HLOOKUP(BrewReport!$F$7,$G$1:$K$2,2,FALSE),\"$3:$\",HLOOKUP(BrewReport!$F$7,$G$1:$K$2,2,FALSE),\"$80\"))), \"\", ROW(INDIRECT(CONCATENATE(\"$\",HLOOKUP(BrewReport!$F$7,$G$1:$K$2,2,FALSE),\"$3:$\",HLOOKUP(BrewReport!$F$7,$G$1:$K$2,2,FALSE),\"$80\")))-MIN(ROW(INDIRECT(CONCATENATE(\"$\",HLOOKUP(BrewReport!$F$7,$G$1:$K$2,2,FALSE),\"$3:$\",HLOOKUP(BrewReport!$F$7,$G$1:$K$2,2,FALSE),\"$80\"))))+1), ROW(A46))),\"\")","v":""}]
["Wheat Light","15 - 20","17","325",null,{"$f":"IFERROR(VLOOKUP(Malt!$A49,BrewReport!$A$9:$D$18,4,FALSE),0)","v":0},{"$f":"F49*N7","v":0},null,{"$f":"F49*N2","v":0},{"$f":"F49*N16","v":0},null,null,null,null,null,{"$f":"IFERROR(INDEX($A$3:$A$75, SMALL(IF(ISBLANK(INDIRECT(CONCATENATE(\"$\",HLOOKUP(BrewReport!$F$7,$G$1:$K$2,2,FALSE),\"$3:$\",HLOOKUP(BrewReport!$F$7,$G$1:$K$2,2,FALSE),\"$80\"))), \"\", ROW(INDIRECT(CONCATENATE(\"$\",HLOOKUP(BrewReport!$F$7,$G$1:$K$2,2,FALSE),\"$3:$\",HLOOKUP(BrewReport!$F$7,$G$1:$K$2,2,FALSE),\"$80\")))-MIN(ROW(INDIRECT(CONCATENATE(\"$\",HLOOKUP(BrewReport!$F$7,$G$1:$K$2,2,FALSE),\"$3:$\",HLOOKUP(BrewReport!$F$7,$G$1:$K$2,2,FALSE),\"$80\"))))+1), ROW(A47))),\"\")","v":""}]
["Wheat Dark",15,15,325,null,{"$f":"IFERROR(VLOOKUP(Malt!$A50,BrewReport!$A$9:$D$18,4,FALSE),0)","v":0},{"$f":"F50*N8","v":0},null,{"$f":"F50*N3","v":0},null,null,null,null,null,null,{"$f":"IFERROR(INDEX($A$3:$A$75, SMALL(IF(ISBLANK(INDIRECT(CONCATENATE(\"$\",HLOOKUP(BrewReport!$F$7,$G$1:$K$2,2,FALSE),\"$3:$\",HLOOKUP(BrewReport!$F$7,$G$1:$K$2,2,FALSE),\"$80\"))), \"\", ROW(INDIRECT(CONCATENATE(\"$\",HLOOKUP(BrewReport!$F$7,$G$1:$K$2,2,FALSE),\"$3:$\",HLOOKUP(BrewReport!$F$7,$G$1:$K$2,2,FALSE),\"$80\")))-MIN(ROW(INDIRECT(CONCATENATE(\"$\",HLOOKUP(BrewReport!$F$7,$G$1:$K$2,2,FALSE),\"$3:$\",HLOOKUP(BrewReport!$F$7,$G$1:$K$2,2,FALSE),\"$80\"))))+1), ROW(A48))),\"\")","v":""}]
["Wheat Munich","20 - 30",25,325,null,{"$f":"IFERROR(VLOOKUP(Malt!$A51,BrewReport!$A$9:$D$18,4,FALSE),0)","v":0},{"$f":"F51*N5","v":0},{"$f":"F51*N7","v":0},{"$f":"F51*N4","v":0},null,{"$f":"F51*N5","v":0},null,null,null,null,{"$f":"IFERROR(INDEX($A$3:$A$75, SMALL(IF(ISBLANK(INDIRECT(CONCATENATE(\"$\",HLOOKUP(BrewReport!$F$7,$G$1:$K$2,2,FALSE),\"$3:$\",HLOOKUP(BrewReport!$F$7,$G$1:$K$2,2,FALSE),\"$80\"))), \"\", ROW(INDIRECT(CONCATENATE(\"$\",HLOOKUP(BrewReport!$F$7,$G$1:$K$2,2,FALSE),\"$3:$\",HLOOKUP(BrewReport!$F$7,$G$1:$K$2,2,FALSE),\"$80\")))-MIN(ROW(INDIRECT(CONCATENATE(\"$\",HLOOKUP(BrewReport!$F$7,$G$1:$K$2,2,FALSE),\"$3:$\",HLOOKUP(BrewReport!$F$7,$G$1:$K$2,2,FALSE),\"$80\"))))+1), ROW(A49))),\"\")","v":""}]
["Wheat Chit","3 - 7",5,"325",null,{"$f":"IFERROR(VLOOKUP(Malt!$A52,BrewReport!$A$9:$D$18,4,FALSE),0)","v":0},{"$f":"F52*N7","v":0},null,null,null,{"$f":"F52*N12","v":0},null,null,null,null,{"$f":"IFERROR(INDEX($A$3:$A$75, SMALL(IF(ISBLANK(INDIRECT(CONCATENATE(\"$\",HLOOKUP(BrewReport!$F$7,$G$1:$K$2,2,FALSE),\"$3:$\",HLOOKUP(BrewReport!$F$7,$G$1:$K$2,2,FALSE),\"$80\"))), \"\", ROW(INDIRECT(CONCATENATE(\"$\",HLOOKUP(BrewReport!$F$7,$G$1:$K$2,2,FALSE),\"$3:$\",HLOOKUP(BrewReport!$F$7,$G$1:$K$2,2,FALSE),\"$80\")))-MIN(ROW(INDIRECT(CONCATENATE(\"$\",HLOOKUP(BrewReport!$F$7,$G$1:$K$2,2,FALSE),\"$3:$\",HLOOKUP(BrewReport!$F$7,$G$1:$K$2,2,FALSE),\"$80\"))))+1), ROW(A50))),\"\")","v":""}]
["Wheat Spelt","3 - 7",5,"300","Sødlig nøddeagtig og krydret, jordagtig smag",{"$f":"IFERROR(VLOOKUP(Malt!$A53,BrewReport!$A$9:$D$18,4,FALSE),0)","v":0},{"$f":"F53*N15","v":0},{"$f":"F53*N16","v":0},{"$f":"F53*N16","v":0},null,null,null,null,null,null,{"$f":"IFERROR(INDEX($A$3:$A$75, SMALL(IF(ISBLANK(INDIRECT(CONCATENATE(\"$\",HLOOKUP(BrewReport!$F$7,$G$1:$K$2,2,FALSE),\"$3:$\",HLOOKUP(BrewReport!$F$7,$G$1:$K$2,2,FALSE),\"$80\"))), \"\", ROW(INDIRECT(CONCATENATE(\"$\",HLOOKUP(BrewReport!$F$7,$G$1:$K$2,2,FALSE),\"$3:$\",HLOOKUP(BrewReport!$F$7,$G$1:$K$2,2,FALSE),\"$80\")))-MIN(ROW(INDIRECT(CONCATENATE(\"$\",HLOOKUP(BrewReport!$F$7,$G$1:$K$2,2,FALSE),\"$3:$\",HLOOKUP(BrewReport!$F$7,$G$1:$K$2,2,FALSE),\"$80\"))))+1), ROW(A51))),\"\")","v":""}]
["Special Malt",null,null,null,null,null,null,null,null,null,null,null,null,null,null,{"$f":"IFERROR(INDEX($A$3:$A$75, SMALL(IF(ISBLANK(INDIRECT(CONCATENATE(\"$\",HLOOKUP(BrewReport!$F$7,$G$1:$K$2,2,FALSE),\"$3:$\",HLOOKUP(BrewReport!$F$7,$G$1:$K$2,2,FALSE),\"$80\"))), \"\", ROW(INDIRECT(CONCATENATE(\"$\",HLOOKUP(BrewReport!$F$7,$G$1:$K$2,2,FALSE),\"$3:$\",HLOOKUP(BrewReport!$F$7,$G$1:$K$2,2,FALSE),\"$80\")))-MIN(ROW(INDIRECT(CONCATENATE(\"$\",HLOOKUP(BrewReport!$F$7,$G$1:$K$2,2,FALSE),\"$3:$\",HLOOKUP(BrewReport!$F$7,$G$1:$K$2,2,FALSE),\"$80\"))))+1), ROW(A52))),\"\")","v":""}]
["Amber","80 - 110","95","290",null,{"$f":"IFERROR(VLOOKUP(Malt!$A55,BrewReport!$A$9:$D$18,4,FALSE),0)","v":0},{"$f":"F55*N10","v":0},null,{"$f":"F55*N7","v":0},{"$f":"F55*N16","v":0},null,null,null,null,null,{"$f":"IFERROR(INDEX($A$3:$A$75, SMALL(IF(ISBLANK(INDIRECT(CONCATENATE(\"$\",HLOOKUP(BrewReport!$F$7,$G$1:$K$2,2,FALSE),\"$3:$\",HLOOKUP(BrewReport!$F$7,$G$1:$K$2,2,FALSE),\"$80\"))), \"\", ROW(INDIRECT(CONCATENATE(\"$\",HLOOKUP(BrewReport!$F$7,$G$1:$K$2,2,FALSE),\"$3:$\",HLOOKUP(BrewReport!$F$7,$G$1:$K$2,2,FALSE),\"$80\")))-MIN(ROW(INDIRECT(CONCATENATE(\"$\",HLOOKUP(BrewReport!$F$7,$G$1:$K$2,2,FALSE),\"$3:$\",HLOOKUP(BrewReport!$F$7,$G$1:$K$2,2,FALSE),\"$80\"))))+1), ROW(A53))),\"\")","v":""}]
["Biscuit","45 - 70","50","300","Kiksesmag, svag smag af black og chokolade",{"$f":"IFERROR(VLOOKUP(Malt!$A56,BrewReport!$A$9:$D$18,4,FALSE),0)","v":0},{"$f":"F56*N10","v":0},{"$f":"F56*N16","v":0},null,{"$f":"F56*N16","v":0},{"$f":"F56*N9","v":0},null,null,null,null,{"$f":"IFERROR(INDEX($A$3:$A$75, SMALL(IF(ISBLANK(INDIRECT(CONCATENATE(\"$\",HLOOKUP(BrewReport!$F$7,$G$1:$K$2,2,FALSE),\"$3:$\",HLOOKUP(BrewReport!$F$7,$G$1:$K$2,2,FALSE),\"$80\"))), \"\", ROW(INDIRECT(CONCATENATE(\"$\",HLOOKUP(BrewReport!$F$7,$G$1:$K$2,2,FALSE),\"$3:$\",HLOOKUP(BrewReport!$F$7,$G$1:$K$2,2,FALSE),\"$80\")))-MIN(ROW(INDIRECT(CONCATENATE(\"$\",HLOOKUP(BrewReport!$F$7,$G$1:$K$2,2,FALSE),\"$3:$\",HLOOKUP(BrewReport!$F$7,$G$1:$K$2,2,FALSE),\"$80\"))))+1), ROW(A54))),\"\")","v":""}]
["Arome",100,100,"300","Blød bitterhed",{"$f":"IFERROR(VLOOKUP(Malt!$A57,BrewReport!$A$9:$D$18,4,FALSE),0)","v":0},{"$f":"F57*N10","v":0},{"$f":"F57*N16","v":0},{"$f":"F57*N7","v":0},null,{"$f":"F57*N7","v":0},null,null,null,null,{"$f":"IFERROR(INDEX($A$3:$A$75, SMALL(IF(ISBLANK(INDIRECT(CONCATENATE(\"$\",HLOOKUP(BrewReport!$F$7,$G$1:$K$2,2,FALSE),\"$3:$\",HLOOKUP(BrewReport!$F$7,$G$1:$K$2,2,FALSE),\"$80\"))), \"\", ROW(INDIRECT(CONCATENATE(\"$\",HLOOKUP(BrewReport!$F$7,$G$1:$K$2,2,FALSE),\"$3:$\",HLOOKUP(BrewReport!$F$7,$G$1:$K$2,2,FALSE),\"$80\")))-MIN(ROW(INDIRECT(CONCATENATE(\"$\",HLOOKUP(BrewReport!$F$7,$G$1:$K$2,2,FALSE),\"$3:$\",HLOOKUP(BrewReport!$F$7,$G$1:$K$2,2,FALSE),\"$80\"))))+1), ROW(A55))),\"\")","v":""}]
["Melano Light",40,40,"310","Intens maltsmag og fylde",{"$f":"IFERROR(VLOOKUP(Malt!$A58,BrewReport!$A$9:$D$18,4,FALSE),0)","v":0},{"$f":"F58*N10","v":0},{"$f":"F58*N16","v":0},null,null,null,null,null,null,null,{"$f":"IFERROR(INDEX($A$3:$A$75, SMALL(IF(ISBLANK(INDIRECT(CONCATENATE(\"$\",HLOOKUP(BrewReport!$F$7,$G$1:$K$2,2,FALSE),\"$3:$\",HLOOKUP(BrewReport!$F$7,$G$1:$K$2,2,FALSE),\"$80\"))), \"\", ROW(INDIRECT(CONCATENATE(\"$\",HLOOKUP(BrewReport!$F$7,$G$1:$K$2,2,FALSE),\"$3:$\",HLOOKUP(BrewReport!$F$7,$G$1:$K$2,2,FALSE),\"$80\")))-MIN(ROW(INDIRECT(CONCATENATE(\"$\",HLOOKUP(BrewReport!$F$7,$G$1:$K$2,2,FALSE),\"$3:$\",HLOOKUP(BrewReport!$F$7,$G$1:$K$2,2,FALSE),\"$80\"))))+1), ROW(A56))),\"\")","v":""}]
["Melano",80,80,"310","Intens maltsmag og fylde",{"$f":"IFERROR(VLOOKUP(Malt!$A59,BrewReport!$A$9:$D$18,4,FALSE),0)","v":0},{"$f":"F59*N10","v":0},{"$f":"F59*N17","v":0},{"$f":"F59*N7","v":0},{"$f":"F59*N16","v":0},{"$f":"F59*N9","v":0},null,null,null,null,{"$f":"IFERROR(INDEX($A$3:$A$75, SMALL(IF(ISBLANK(INDIRECT(CONCATENATE(\"$\",HLOOKUP(BrewReport!$F$7,$G$1:$K$2,2,FALSE),\"$3:$\",HLOOKUP(BrewReport!$F$7,$G$1:$K$2,2,FALSE),\"$80\"))), \"\", ROW(INDIRECT(CONCATENATE(\"$\",HLOOKUP(BrewReport!$F$7,$G$1:$K$2,2,FALSE),\"$3:$\",HLOOKUP(BrewReport!$F$7,$G$1:$K$2,2,FALSE),\"$80\")))-MIN(ROW(INDIRECT(CONCATENATE(\"$\",HLOOKUP(BrewReport!$F$7,$G$1:$K$2,2,FALSE),\"$3:$\",HLOOKUP(BrewReport!$F$7,$G$1:$K$2,2,FALSE),\"$80\"))))+1), ROW(A57))),\"\")","v":""}]
["Boghvede / Buckwheat","4 - 15","9","275","Malt og nøddeagtig smag. Glutenfri",{"$f":"IFERROR(VLOOKUP(Malt!$A60,BrewReport!$A$9:$D$18,4,FALSE),0)","v":0},null,{"$f":"F60*N17","v":0},{"$f":"F60*N13","v":0},null,{"$f":"F60*42","v":0},null,null,null,null,{"$f":"IFERROR(INDEX($A$3:$A$75, SMALL(IF(ISBLANK(INDIRECT(CONCATENATE(\"$\",HLOOKUP(BrewReport!$F$7,$G$1:$K$2,2,FALSE),\"$3:$\",HLOOKUP(BrewReport!$F$7,$G$1:$K$2,2,FALSE),\"$80\"))), \"\", ROW(INDIRECT(CONCATENATE(\"$\",HLOOKUP(BrewReport!$F$7,$G$1:$K$2,2,FALSE),\"$3:$\",HLOOKUP(BrewReport!$F$7,$G$1:$K$2,2,FALSE),\"$80\")))-MIN(ROW(INDIRECT(CONCATENATE(\"$\",HLOOKUP(BrewReport!$F$7,$G$1:$K$2,2,FALSE),\"$3:$\",HLOOKUP(BrewReport!$F$7,$G$1:$K$2,2,FALSE),\"$80\"))))+1), ROW(A58))),\"\")","v":""}]
["Sauer / Acid","6 - 12","9","220","Rund og stabil smag",{"$f":"IFERROR(VLOOKUP(Malt!$A61,BrewReport!$A$9:$D$18,4,FALSE),0)","v":0},{"$f":"F61*N10","v":0},{"$f":"F61*N17","v":0},{"$f":"F61*N9","v":0},{"$f":"F61*N7","v":0},{"$f":"F61*32","v":0},null,null,null,null,{"$f":"IFERROR(INDEX($A$3:$A$75, SMALL(IF(ISBLANK(INDIRECT(CONCATENATE(\"$\",HLOOKUP(BrewReport!$F$7,$G$1:$K$2,2,FALSE),\"$3:$\",HLOOKUP(BrewReport!$F$7,$G$1:$K$2,2,FALSE),\"$80\"))), \"\", ROW(INDIRECT(CONCATENATE(\"$\",HLOOKUP(BrewReport!$F$7,$G$1:$K$2,2,FALSE),\"$3:$\",HLOOKUP(BrewReport!$F$7,$G$1:$K$2,2,FALSE),\"$80\")))-MIN(ROW(INDIRECT(CONCATENATE(\"$\",HLOOKUP(BrewReport!$F$7,$G$1:$K$2,2,FALSE),\"$3:$\",HLOOKUP(BrewReport!$F$7,$G$1:$K$2,2,FALSE),\"$80\"))))+1), ROW(A59))),\"\")","v":""}]
["Chateau Diastatic","3,5 - 4,5","4","275","Enzymer. Hæver udbyttet",{"$f":"IFERROR(VLOOKUP(Malt!$A62,BrewReport!$A$9:$D$18,4,FALSE),0)","v":0},null,null,null,null,{"$f":"F62*N9","v":0},null,null,null,null,{"$f":"IFERROR(INDEX($A$3:$A$75, SMALL(IF(ISBLANK(INDIRECT(CONCATENATE(\"$\",HLOOKUP(BrewReport!$F$7,$G$1:$K$2,2,FALSE),\"$3:$\",HLOOKUP(BrewReport!$F$7,$G$1:$K$2,2,FALSE),\"$80\"))), \"\", ROW(INDIRECT(CONCATENATE(\"$\",HLOOKUP(BrewReport!$F$7,$G$1:$K$2,2,FALSE),\"$3:$\",HLOOKUP(BrewReport!$F$7,$G$1:$K$2,2,FALSE),\"$80\")))-MIN(ROW(INDIRECT(CONCATENATE(\"$\",HLOOKUP(BrewReport!$F$7,$G$1:$K$2,2,FALSE),\"$3:$\",HLOOKUP(BrewReport!$F$7,$G$1:$K$2,2,FALSE),\"$80\"))))+1), ROW(A60))),\"\")","v":""}]
["Abbey",45,45,"280","Stærkere smag af kogt brød, nødder og frugt",{"$f":"IFERROR(VLOOKUP(Malt!$A63,BrewReport!$A$9:$D$18,4,FALSE),0)","v":0},{"$f":"F63*N10","v":0},{"$f":"F63*N16","v":0},{"$f":"F63*N2","v":0},null,{"$f":"F63*N7","v":0},null,null,null,null,{"$f":"IFERROR(INDEX($A$3:$A$75, SMALL(IF(ISBLANK(INDIRECT(CONCATENATE(\"$\",HLOOKUP(BrewReport!$F$7,$G$1:$K$2,2,FALSE),\"$3:$\",HLOOKUP(BrewReport!$F$7,$G$1:$K$2,2,FALSE),\"$80\"))), \"\", ROW(INDIRECT(CONCATENATE(\"$\",HLOOKUP(BrewReport!$F$7,$G$1:$K$2,2,FALSE),\"$3:$\",HLOOKUP(BrewReport!$F$7,$G$1:$K$2,2,FALSE),\"$80\")))-MIN(ROW(INDIRECT(CONCATENATE(\"$\",HLOOKUP(BrewReport!$F$7,$G$1:$K$2,2,FALSE),\"$3:$\",HLOOKUP(BrewReport!$F$7,$G$1:$K$2,2,FALSE),\"$80\"))))+1), ROW(A61))),\"\")","v":""}]
["Peated / Røg","5 - 10","7","310",null,{"$f":"IFERROR(VLOOKUP(Malt!$A64,BrewReport!$A$9:$D$18,4,FALSE),0)","v":0},{"$f":"F64*N10","v":0},{"$f":"F64*N16","v":0},{"$f":"F64*N5","v":0},{"$f":"F64*N15","v":0},{"$f":"F64*N9","v":0},null,null,null,null,{"$f":"IFERROR(INDEX($A$3:$A$75, SMALL(IF(ISBLANK(INDIRECT(CONCATENATE(\"$\",HLOOKUP(BrewReport!$F$7,$G$1:$K$2,2,FALSE),\"$3:$\",HLOOKUP(BrewReport!$F$7,$G$1:$K$2,2,FALSE),\"$80\"))), \"\", ROW(INDIRECT(CONCATENATE(\"$\",HLOOKUP(BrewReport!$F$7,$G$1:$K$2,2,FALSE),\"$3:$\",HLOOKUP(BrewReport!$F$7,$G$1:$K$2,2,FALSE),\"$80\")))-MIN(ROW(INDIRECT(CONCATENATE(\"$\",HLOOKUP(BrewReport!$F$7,$G$1:$K$2,2,FALSE),\"$3:$\",HLOOKUP(BrewReport!$F$7,$G$1:$K$2,2,FALSE),\"$80\"))))+1), ROW(A62))),\"\")","v":""}]
["Oat","2 - 4","3","0","Brødsmag, blødhed og fylde. Husk at koge det inden mæskning.",{"$f":"IFERROR(VLOOKUP(Malt!$A65,BrewReport!$A$9:$D$18,4,FALSE),0)","v":0},null,{"$f":"F65*N17","v":0},null,null,null,null,null,null,null,{"$f":"IFERROR(INDEX($A$3:$A$75, SMALL(IF(ISBLANK(INDIRECT(CONCATENATE(\"$\",HLOOKUP(BrewReport!$F$7,$G$1:$K$2,2,FALSE),\"$3:$\",HLOOKUP(BrewReport!$F$7,$G$1:$K$2,2,FALSE),\"$80\"))), \"\", ROW(INDIRECT(CONCATENATE(\"$\",HLOOKUP(BrewReport!$F$7,$G$1:$K$2,2,FALSE),\"$3:$\",HLOOKUP(BrewReport!$F$7,$G$1:$K$2,2,FALSE),\"$80\")))-MIN(ROW(INDIRECT(CONCATENATE(\"$\",HLOOKUP(BrewReport!$F$7,$G$1:$K$2,2,FALSE),\"$3:$\",HLOOKUP(BrewReport!$F$7,$G$1:$K$2,2,FALSE),\"$80\"))))+1), ROW(A63))),\"\")","v":""}]
["Rye","4 - 10","7","240","Lidt rug smag og kompleksitet",{"$f":"IFERROR(VLOOKUP(Malt!$A66,BrewReport!$A$9:$D$18,4,FALSE),0)","v":0},{"$f":"F66*N9","v":0},{"$f":"F66*N15","v":0},{"$f":"F66*N8","v":0},null,{"$f":"F66*N10","v":0},null,null,null,null,{"$f":"IFERROR(INDEX($A$3:$A$75, SMALL(IF(ISBLANK(INDIRECT(CONCATENATE(\"$\",HLOOKUP(BrewReport!$F$7,$G$1:$K$2,2,FALSE),\"$3:$\",HLOOKUP(BrewReport!$F$7,$G$1:$K$2,2,FALSE),\"$80\"))), \"\", ROW(INDIRECT(CONCATENATE(\"$\",HLOOKUP(BrewReport!$F$7,$G$1:$K$2,2,FALSE),\"$3:$\",HLOOKUP(BrewReport!$F$7,$G$1:$K$2,2,FALSE),\"$80\")))-MIN(ROW(INDIRECT(CONCATENATE(\"$\",HLOOKUP(BrewReport!$F$7,$G$1:$K$2,2,FALSE),\"$3:$\",HLOOKUP(BrewReport!$F$7,$G$1:$K$2,2,FALSE),\"$80\"))))+1), ROW(A64))),\"\")","v":""}]
["Barley Chit","3 - 7",5,"270","Rig og tør kornagtig smag, Stabilt skum",{"$f":"IFERROR(VLOOKUP(Malt!$A67,BrewReport!$A$9:$D$18,4,FALSE),0)","v":0},{"$f":"F67*N7","v":0},null,null,null,{"$f":"F67*N12","v":0},null,null,null,null,{"$f":"IFERROR(INDEX($A$3:$A$75, SMALL(IF(ISBLANK(INDIRECT(CONCATENATE(\"$\",HLOOKUP(BrewReport!$F$7,$G$1:$K$2,2,FALSE),\"$3:$\",HLOOKUP(BrewReport!$F$7,$G$1:$K$2,2,FALSE),\"$80\"))), \"\", ROW(INDIRECT(CONCATENATE(\"$\",HLOOKUP(BrewReport!$F$7,$G$1:$K$2,2,FALSE),\"$3:$\",HLOOKUP(BrewReport!$F$7,$G$1:$K$2,2,FALSE),\"$80\")))-MIN(ROW(INDIRECT(CONCATENATE(\"$\",HLOOKUP(BrewReport!$F$7,$G$1:$K$2,2,FALSE),\"$3:$\",HLOOKUP(BrewReport!$F$7,$G$1:$K$2,2,FALSE),\"$80\"))))+1), ROW(A65))),\"\")","v":""}]
["Barley Flaked","3 - 7",5,270,"Rig og tør kornagtig smag, Stabilt skum",{"$f":"IFERROR(VLOOKUP(Malt!$A68,BrewReport!$A$9:$D$18,4,FALSE),0)","v":0},{"$f":"F68*N8","v":0},{"$f":"F68*N16","v":0},null,{"$f":"F68*N16","v":0},null,null,null,null,null,{"$f":"IFERROR(INDEX($A$3:$A$75, SMALL(IF(ISBLANK(INDIRECT(CONCATENATE(\"$\",HLOOKUP(BrewReport!$F$7,$G$1:$K$2,2,FALSE),\"$3:$\",HLOOKUP(BrewReport!$F$7,$G$1:$K$2,2,FALSE),\"$80\"))), \"\", ROW(INDIRECT(CONCATENATE(\"$\",HLOOKUP(BrewReport!$F$7,$G$1:$K$2,2,FALSE),\"$3:$\",HLOOKUP(BrewReport!$F$7,$G$1:$K$2,2,FALSE),\"$80\")))-MIN(ROW(INDIRECT(CONCATENATE(\"$\",HLOOKUP(BrewReport!$F$7,$G$1:$K$2,2,FALSE),\"$3:$\",HLOOKUP(BrewReport!$F$7,$G$1:$K$2,2,FALSE),\"$80\"))))+1), ROW(A66))),\"\")","v":""}]
["Torrefied Maize Flaked","1,5","1,5","310","Let smag",{"$f":"IFERROR(VLOOKUP(Malt!$A69,BrewReport!$A$9:$D$18,4,FALSE),0)","v":0},{"$f":"F69*N8","v":0},{"$f":"F69*N16","v":0},null,null,null,null,null,null,null,{"$f":"IFERROR(INDEX($A$3:$A$75, SMALL(IF(ISBLANK(INDIRECT(CONCATENATE(\"$\",HLOOKUP(BrewReport!$F$7,$G$1:$K$2,2,FALSE),\"$3:$\",HLOOKUP(BrewReport!$F$7,$G$1:$K$2,2,FALSE),\"$80\"))), \"\", ROW(INDIRECT(CONCATENATE(\"$\",HLOOKUP(BrewReport!$F$7,$G$1:$K$2,2,FALSE),\"$3:$\",HLOOKUP(BrewReport!$F$7,$G$1:$K$2,2,FALSE),\"$80\")))-MIN(ROW(INDIRECT(CONCATENATE(\"$\",HLOOKUP(BrewReport!$F$7,$G$1:$K$2,2,FALSE),\"$3:$\",HLOOKUP(BrewReport!$F$7,$G$1:$K$2,2,FALSE),\"$80\"))))+1), ROW(A67))),\"\")","v":""}]
["Oat Flaked","3 - 7",5,"0","Brødsmag, blødhed og fylde. Husk pause i mæskningen.",{"$f":"IFERROR(VLOOKUP(Malt!$A70,BrewReport!$A$9:$D$18,4,FALSE),0)","v":0},{"$f":"F70*N8","v":0},null,{"$f":"F70*N16","v":0},null,{"$f":"F70*32","v":0},null,null,null,null,{"$f":"IFERROR(INDEX($A$3:$A$75, SMALL(IF(ISBLANK(INDIRECT(CONCATENATE(\"$\",HLOOKUP(BrewReport!$F$7,$G$1:$K$2,2,FALSE),\"$3:$\",HLOOKUP(BrewReport!$F$7,$G$1:$K$2,2,FALSE),\"$80\"))), \"\", ROW(INDIRECT(CONCATENATE(\"$\",HLOOKUP(BrewReport!$F$7,$G$1:$K$2,2,FALSE),\"$3:$\",HLOOKUP(BrewReport!$F$7,$G$1:$K$2,2,FALSE),\"$80\")))-MIN(ROW(INDIRECT(CONCATENATE(\"$\",HLOOKUP(BrewReport!$F$7,$G$1:$K$2,2,FALSE),\"$3:$\",HLOOKUP(BrewReport!$F$7,$G$1:$K$2,2,FALSE),\"$80\"))))+1), ROW(A68))),\"\")","v":""}]
["Torrefied Oat Flakes","2,8 - 5","4","0","Forbedrer mundfylden og skummet",{"$f":"IFERROR(VLOOKUP(Malt!$A71,BrewReport!$A$9:$D$18,4,FALSE),0)","v":0},null,{"$f":"F71*N16","v":0},null,null,null,null,null,null,null,{"$f":"IFERROR(INDEX($A$3:$A$75, SMALL(IF(ISBLANK(INDIRECT(CONCATENATE(\"$\",HLOOKUP(BrewReport!$F$7,$G$1:$K$2,2,FALSE),\"$3:$\",HLOOKUP(BrewReport!$F$7,$G$1:$K$2,2,FALSE),\"$80\"))), \"\", ROW(INDIRECT(CONCATENATE(\"$\",HLOOKUP(BrewReport!$F$7,$G$1:$K$2,2,FALSE),\"$3:$\",HLOOKUP(BrewReport!$F$7,$G$1:$K$2,2,FALSE),\"$80\")))-MIN(ROW(INDIRECT(CONCATENATE(\"$\",HLOOKUP(BrewReport!$F$7,$G$1:$K$2,2,FALSE),\"$3:$\",HLOOKUP(BrewReport!$F$7,$G$1:$K$2,2,FALSE),\"$80\"))))+1), ROW(A69))),\"\")","v":""}]
["Wheat Flaked","3,0 - 7,0",5,"290","Stabilt skum",{"$f":"IFERROR(VLOOKUP(Malt!$A72,BrewReport!$A$9:$D$18,4,FALSE),0)","v":0.5},{"$f":"F72*N8","v":10.5},{"$f":"F72*N7","v":10},{"$f":"F72*N12","v":12.5},null,null,null,null,null,null,{"$f":"IFERROR(INDEX($A$3:$A$75, SMALL(IF(ISBLANK(INDIRECT(CONCATENATE(\"$\",HLOOKUP(BrewReport!$F$7,$G$1:$K$2,2,FALSE),\"$3:$\",HLOOKUP(BrewReport!$F$7,$G$1:$K$2,2,FALSE),\"$80\"))), \"\", ROW(INDIRECT(CONCATENATE(\"$\",HLOOKUP(BrewReport!$F$7,$G$1:$K$2,2,FALSE),\"$3:$\",HLOOKUP(BrewReport!$F$7,$G$1:$K$2,2,FALSE),\"$80\")))-MIN(ROW(INDIRECT(CONCATENATE(\"$\",HLOOKUP(BrewReport!$F$7,$G$1:$K$2,2,FALSE),\"$3:$\",HLOOKUP(BrewReport!$F$7,$G$1:$K$2,2,FALSE),\"$80\"))))+1), ROW(A70))),\"\")","v":""}]
["Torrefied Rice Flaked","0","0","270","Masser af stivelse, øger alkohol%",{"$f":"IFERROR(VLOOKUP(Malt!$A73,BrewReport!$A$9:$D$18,4,FALSE),0)","v":0},{"$f":"F73*N8","v":0},{"$f":"F73*N16","v":0},{"$f":"F73*38","v":0},{"$f":"F73*N7","v":0},null,null,null,null,null,{"$f":"IFERROR(INDEX($A$3:$A$75, SMALL(IF(ISBLANK(INDIRECT(CONCATENATE(\"$\",HLOOKUP(BrewReport!$F$7,$G$1:$K$2,2,FALSE),\"$3:$\",HLOOKUP(BrewReport!$F$7,$G$1:$K$2,2,FALSE),\"$80\"))), \"\", ROW(INDIRECT(CONCATENATE(\"$\",HLOOKUP(BrewReport!$F$7,$G$1:$K$2,2,FALSE),\"$3:$\",HLOOKUP(BrewReport!$F$7,$G$1:$K$2,2,FALSE),\"$80\")))-MIN(ROW(INDIRECT(CONCATENATE(\"$\",HLOOKUP(BrewReport!$F$7,$G$1:$K$2,2,FALSE),\"$3:$\",HLOOKUP(BrewReport!$F$7,$G$1:$K$2,2,FALSE),\"$80\"))))+1), ROW(A71))),\"\")","v":""}]
["Whisky            30 - 45 ppm","30 - 45",38,"300","Tørv- og røgsmag",{"$f":"IFERROR(VLOOKUP(Malt!$A74,BrewReport!$A$9:$D$18,4,FALSE),0)","v":0},null,{"$f":"F74*N16","v":0},{"$f":"F74*N7","v":0},null,null,null,null,null,null,{"$f":"IFERROR(INDEX($A$3:$A$75, SMALL(IF(ISBLANK(INDIRECT(CONCATENATE(\"$\",HLOOKUP(BrewReport!$F$7,$G$1:$K$2,2,FALSE),\"$3:$\",HLOOKUP(BrewReport!$F$7,$G$1:$K$2,2,FALSE),\"$80\"))), \"\", ROW(INDIRECT(CONCATENATE(\"$\",HLOOKUP(BrewReport!$F$7,$G$1:$K$2,2,FALSE),\"$3:$\",HLOOKUP(BrewReport!$F$7,$G$1:$K$2,2,FALSE),\"$80\")))-MIN(ROW(INDIRECT(CONCATENATE(\"$\",HLOOKUP(BrewReport!$F$7,$G$1:$K$2,2,FALSE),\"$3:$\",HLOOKUP(BrewReport!$F$7,$G$1:$K$2,2,FALSE),\"$80\"))))+1), ROW(A72))),\"\")","v":""}]
["Whisky Light    15 - 25 ppm","15 - 25",20,"300","Tørv- og røgsmag",{"$f":"IFERROR(VLOOKUP(Malt!$A75,BrewReport!$A$9:$D$18,4,FALSE),0)","v":0},null,{"$f":"F75*N16","v":0},null,null,null,null,null,null,null,{"$f":"IFERROR(INDEX($A$3:$A$75, SMALL(IF(ISBLANK(INDIRECT(CONCATENATE(\"$\",HLOOKUP(BrewReport!$F$7,$G$1:$K$2,2,FALSE),\"$3:$\",HLOOKUP(BrewReport!$F$7,$G$1:$K$2,2,FALSE),\"$80\"))), \"\", ROW(INDIRECT(CONCATENATE(\"$\",HLOOKUP(BrewReport!$F$7,$G$1:$K$2,2,FALSE),\"$3:$\",HLOOKUP(BrewReport!$F$7,$G$1:$K$2,2,FALSE),\"$80\")))-MIN(ROW(INDIRECT(CONCATENATE(\"$\",HLOOKUP(BrewReport!$F$7,$G$1:$K$2,2,FALSE),\"$3:$\",HLOOKUP(BrewReport!$F$7,$G$1:$K$2,2,FALSE),\"$80\"))))+1), ROW(A73))),\"\")","v":""}]
["Ialt",null,null,null,null,{"$f":"SUM(F3:F75)","v":6},115.5,120,60.5,132,99,null,null,null,null,{"$f":"IFERROR(INDEX($A$3:$A$75, SMALL(IF(ISBLANK(INDIRECT(CONCATENATE(\"$\",HLOOKUP(BrewReport!$F$7,$G$1:$K$2,2,FALSE),\"$3:$\",HLOOKUP(BrewReport!$F$7,$G$1:$K$2,2,FALSE),\"$80\"))), \"\", ROW(INDIRECT(CONCATENATE(\"$\",HLOOKUP(BrewReport!$F$7,$G$1:$K$2,2,FALSE),\"$3:$\",HLOOKUP(BrewReport!$F$7,$G$1:$K$2,2,FALSE),\"$80\")))-MIN(ROW(INDIRECT(CONCATENATE(\"$\",HLOOKUP(BrewReport!$F$7,$G$1:$K$2,2,FALSE),\"$3:$\",HLOOKUP(BrewReport!$F$7,$G$1:$K$2,2,FALSE),\"$80\"))))+1), ROW(A69))),\"\")","v":""}]
["Valsning og håndtering",null,null,null,null,null,28,0,20,{"$f":"2 * (F77/1000)","v":0},25,null,null,null,null,{"$f":"IFERROR(INDEX($A$3:$A$75, SMALL(IF(ISBLANK(INDIRECT(CONCATENATE(\"$\",HLOOKUP(BrewReport!$F$7,$G$1:$K$2,2,FALSE),\"$3:$\",HLOOKUP(BrewReport!$F$7,$G$1:$K$2,2,FALSE),\"$80\"))), \"\", ROW(INDIRECT(CONCATENATE(\"$\",HLOOKUP(BrewReport!$F$7,$G$1:$K$2,2,FALSE),\"$3:$\",HLOOKUP(BrewReport!$F$7,$G$1:$K$2,2,FALSE),\"$80\")))-MIN(ROW(INDIRECT(CONCATENATE(\"$\",HLOOKUP(BrewReport!$F$7,$G$1:$K$2,2,FALSE),\"$3:$\",HLOOKUP(BrewReport!$F$7,$G$1:$K$2,2,FALSE),\"$80\"))))+1), ROW(A70))),\"\")","v":""}]
["Forsendelse uden omdeling (Post dk) (<=10kg)","Tast 1 for at vælge fragt >",null,1,null,null,{"$f":"IF(D78=1,59,0)","v":59},{"$f":"IF(D78=1,30,0)","v":30},{"$f":"IF(D78=1,55,0)","v":55},{"$f":"IF(D78=1,49,0)","v":49},{"$f":"IF(D78=1,60,0)","v":60},null,null,null,null,{"$f":"IFERROR(INDEX($A$3:$A$75, SMALL(IF(ISBLANK(INDIRECT(CONCATENATE(\"$\",HLOOKUP(BrewReport!$F$7,$G$1:$K$2,2,FALSE),\"$3:$\",HLOOKUP(BrewReport!$F$7,$G$1:$K$2,2,FALSE),\"$80\"))), \"\", ROW(INDIRECT(CONCATENATE(\"$\",HLOOKUP(BrewReport!$F$7,$G$1:$K$2,2,FALSE),\"$3:$\",HLOOKUP(BrewReport!$F$7,$G$1:$K$2,2,FALSE),\"$80\")))-MIN(ROW(INDIRECT(CONCATENATE(\"$\",HLOOKUP(BrewReport!$F$7,$G$1:$K$2,2,FALSE),\"$3:$\",HLOOKUP(BrewReport!$F$7,$G$1:$K$2,2,FALSE),\"$80\"))))+1), ROW(A71))),\"\")","v":""}]
["Ialt",null,null,null,null,null,{"$f":"SUM(G76:G78)","v":202.5},{"$f":"SUM(H76:H78)","v":150},{"$f":"SUM(I76:I78)","v":135.5},{"$f":"SUM(J76:J78)","v":181},{"$f":"SUM(K76:K78)","v":184},null,null,null,null,{"$f":"IFERROR(INDEX($A$3:$A$75, SMALL(IF(ISBLANK(INDIRECT(CONCATENATE(\"$\",HLOOKUP(BrewReport!$F$7,$G$1:$K$2,2,FALSE),\"$3:$\",HLOOKUP(BrewReport!$F$7,$G$1:$K$2,2,FALSE),\"$80\"))), \"\", ROW(INDIRECT(CONCATENATE(\"$\",HLOOKUP(BrewReport!$F$7,$G$1:$K$2,2,FALSE),\"$3:$\",HLOOKUP(BrewReport!$F$7,$G$1:$K$2,2,FALSE),\"$80\")))-MIN(ROW(INDIRECT(CONCATENATE(\"$\",HLOOKUP(BrewReport!$F$7,$G$1:$K$2,2,FALSE),\"$3:$\",HLOOKUP(BrewReport!$F$7,$G$1:$K$2,2,FALSE),\"$80\"))))+1), ROW(A72))),\"\")","v":""}]
[null,null,null,null,null,null,null,null,null,null,null,null,null,null,null,{"$f":"IFERROR(INDEX($A$3:$A$75, SMALL(IF(ISBLANK(INDIRECT(CONCATENATE(\"$\",HLOOKUP(BrewReport!$F$7,$G$1:$K$2,2,FALSE),\"$3:$\",HLOOKUP(BrewReport!$F$7,$G$1:$K$2,2,FALSE),\"$80\"))), \"\", ROW(INDIRECT(CONCATENATE(\"$\",HLOOKUP(BrewReport!$F$7,$G$1:$K$2,2,FALSE),\"$3:$\",HLOOKUP(BrewReport!$F$7,$G$1:$K$2,2,FALSE),\"$80\")))-MIN(ROW(INDIRECT(CONCATENATE(\"$\",HLOOKUP(BrewReport!$F$7,$G$1:$K$2,2,FALSE),\"$3:$\",HLOOKUP(BrewReport!$F$7,$G$1:$K$2,2,FALSE),\"$80\"))))+1), ROW(A73))),\"\")","v":""}]
[null,null,null,null,null,null,null,null,null,null,null,null,null,null,null,{"$f":"IFERROR(INDEX($A$3:$A$75, SMALL(IF(ISBLANK(INDIRECT(CONCATENATE(\"$\",HLOOKUP(BrewReport!$F$7,$G$1:$K$2,2,FALSE),\"$3:$\",HLOOKUP(BrewReport!$F$7,$G$1:$K$2,2,FALSE),\"$79\"))), \"\", ROW(INDIRECT(CONCATENATE(\"$\",HLOOKUP(BrewReport!$F$7,$G$1:$K$2,2,FALSE),\"$3:$\",HLOOKUP(BrewReport!$F$7,$G$1:$K$2,2,FALSE),\"$79\")))-MIN(ROW(INDIRECT(CONCATENATE(\"$\",HLOOKUP(BrewReport!$F$7,$G$1:$K$2,2,FALSE),\"$3:$\",HLOOKUP(BrewReport!$F$7,$G$1:$K$2,2,FALSE),\"$79\"))))+1), ROW(A74))),\"\")","v":""}]
[null,null,null,null,null,null,null,null,null,null,null,null,null,null,null,{"$f":"IFERROR(INDEX(#REF!, SMALL(IF(ISBLANK(INDIRECT(CONCATENATE(\"$\",HLOOKUP(BrewReport!$F$7,$G$1:$K$2,2,FALSE),\"$3:$\",HLOOKUP(BrewReport!$F$7,$G$1:$K$2,2,FALSE),\"$79\"))), \"\", ROW(INDIRECT(CONCATENATE(\"$\",HLOOKUP(BrewReport!$F$7,$G$1:$K$2,2,FALSE),\"$3:$\",HLOOKUP(BrewReport!$F$7,$G$1:$K$2,2,FALSE),\"$79\")))-MIN(ROW(INDIRECT(CONCATENATE(\"$\",HLOOKUP(BrewReport!$F$7,$G$1:$K$2,2,FALSE),\"$3:$\",HLOOKUP(BrewReport!$F$7,$G$1:$K$2,2,FALSE),\"$79\"))))+1), ROW(#REF!))),\"\")","v":""}]

{"sheet":"Malt X-ref.","index":6,"n_rows":39,"n_cols":10,"rows_kept":39,"cut":false,"hidden":false,"merged":[[0,0,0,9]]}
[]
[null,"WEYERMANN","Castle Malting","MUNTONS","BRIESS","FAWCETT","BAIRDS","CRISP","GAMBRINUS","DINGEMANS"]
[null,"(German)","(Belgian)","(British)","(American)","(British)","(British)","(British)","(Canadian)","(Belgian)"]
[null,"Bohemian Pilsner","Pilsner","Lager","Pilsner","Lager",null,"Lager",null,"Pilsen"]
[null,"Pale","Pale Ale","Pale","Brewers 2-Row","Pale Ale","Pale Ale","Pale","Pale","Pale Ale"]
[null,null,"Maris Otter Ale","Maris Otter",null,"Maris Otter",null,null,"ESB"]
[null,"Vienna","Vienna","Mild","Vienna","Vienna","Vienna","Ashburne/Vienna"]
[null,"Abbey","Abbey"]
[null,"Munich Type I, Light","Munich Light",null,"Bonlander",null,null,null,null,"Munich"]
[null,"Munich Type II, Dark","Munich",null,"Munich 10L",null,null,null,"Munich 10L"]
[null,"Carafoam/Dextrin",null,"Caramalt","Carapils/Dextrin","Caramalt",null,"Carapils",null,"Cara 8/Carapils"]
[null,"Melanoidin","Melanoidin/ Melano",null,"Victory","Amber",null,"Amber",null,"Aromatic/Biscuit"]
[null,"CaraHell","Cara Blond","Carapils","Crystal 10L"]
[null,"CaraBelge","Melano Light",null,null,null,"Light Carastan (10-15L)"]
[null,"CaraRed","Cara Ruby",null,"Crystal 20L",null,null,null,null,"Cara 20/CaraVienne"]
[null,"CaraAmber","Aroma",null,"Victory",null,null,null,"Munich 30","Biscuit"]
[null,null,null,null,"Crystal 30L","Pale Crystal","Carastan"]
[null,"CaraMunich I","Cara Gold",null,"Crystal 40L","Crystal Malt (40 - 50)",null,null,null,"Cara 45"]
[null,"CaraMunich II","Cara Gold","Medium Crystal"]
[null,"CaraMunich III","Café Light",null,"Crystal 60L","Crystal Malt II (60 - 70)"]
[null,"CaraBohemian",null,null,"Crystal 80L","Dark Crystal (85 - 95)","Crystal"]
[null,null,null,null,"Crystal 90L"]
[null,"CaraAroma","Café","Dark Crystal","Crystal 120L","Dark Crystal II (118 - 124)","Dark Crystal"]
[null,null,null,null,"Special Roast","Brown Malt","Brown Malt"]
[null,null,null,null,"Extra Special Roast",null,null,null,null,"Special B"]
[null,"Carafa I, dehusked","Chocolate",null,null,"Pale Chocolate"]
[null,"Carafa II, dehusked","Black","Chocolate","Chocolate","Chocolate","Chocolate","Chocolate",null,"Chocolate"]
[null,"Carafa III, dehusked","Black","Black Patent","Black Patent","Black Malt","Black Malt","Black","De-Bittered Black"]
[null,"Roasted Barley","Roasted Barley","Roasted Barley","Roasted Barley","Roasted Barley","Roasted Barley"]
[null,"Chocolate Wheat",null,null,null,"Roasted Wheat",null,null,null,"Roasted Wheat"]
[null,"Pale Wheat, Light","Wheat","Wheat","Wheat","Wheat",null,"Wheat",null,"Pale Wheat"]
[null,"Dark Wheat","Munich Wheat"]
[null,"Caramel Wheat",null,null,null,"Crystal Wheat"]
[null,"Chocolate Rye"]
[null,"Rye Malt",null,null,"Rye Malt","Rye Malt"]
[null,"Caramel Rye"]
[null,null,null,null,null,null,null,null,"Honey"]
[null,"Acidulated Malt","Acid"]
[null,"Smoked Malt, Beechwood","Smoked",null,null,"Peated Malt (Peat Smoked)"]

{"sheet":"Humle","index":7,"n_rows":45,"n_cols":27,"rows_kept":45,"cut":false,"hidden":false,"merged":[[0,16,1,24],[0,13,1,15],[4,14,6,14],[4,15,6,15],[4,16,6,16],[4,17,6,17],[4,18,6,18],[4,19,6,19],[4,20,6,20],[4,21,6,21],[4,22,6,22],[4,23,6,23],[4,24,6,24],[41,0,41,3],[37,13,37,19],[3,14,3,24],[3,13,6,13],[35,13,35,19]]}
["Humletyper","Blomst / Pellet","Alfa Range %","IBU Avg.",null,"Beta Range %","Co-humulione %","Usage","Brewing usage","Used in","Aroma","Substitutes",null,"Glenn Tinseth's website",null,null,"Decimal Alpha Acid Utilization vs. Boil Time and Wort Original Gravity"]
[null,null,null,"Blomst","Pellet",null,null,"B/A",null,null,null,null,null,null,null,null,null,null,null,null,null,null,null,null,null,null,"Blomst/Pellet"]
["Admiral","P","13,0 - 16,0",null,14.2,"4,0 - 6,0","37 - 45","B","High alpha bittering hops. From Horticulture Research International,Wye College, Kent, England. It is a descendant of Northdown and Challenger","ESB, IPAs, Ales and Bitter","Discrete pine and fresh herbal character mixed with delicate citrus. "]
["Amarillo","P","8,0 - 11,0",null,8.8000000000000007,"6,0 - 7,0","21 - 24","BA","Unknown origin, but character similar to Cascade. Used for both bitterness and aroma","IPAs, Ales","Floral, tropical, and citrus (lemon, orange and grapefruit)","Cascade, Centennial, Simcoe",null,"Boil Time (min)","Original Gravity",null,null,null,null,null,null,null,null,null,null,null,"Blomst"]
["Bramling X","P","5,0 - 7,8",null,4,"2,3 - 3,5",34,"A","Developed in 1927 from commercial Goldings and wild hop variety.","ESB, Bitters, Pale Ale","Mild, fruity, currant aroma.","East Kent Goldings, Progress, Whitbred",null,null,1.03,1.04,1.05,1.06,1.07,1.08,1.0900000000000001,1.1000000000000001,1.1100000000000001,1.1200000000000001,1.1299999999999999,null,"Pellet"]
["Brewer's Gold","B","5,5 - 10,0",5.8,6.3,"3,5 - 4,5","37 - 40","B","Traditional bittering hop. An English variety and sibling of Bullion","English ales and heavy German lagers.","Spicy, fruity characteristics, black currant","Northern Brewer, Galena, Chinook, Eroica, Nugget"]
["Calypso","P","12,0 - 14,0",null,15.5,"5,0 - 6,0","40 - 42","BA","Calypso is a Yakima Valley bred, dual-purpose diploid hop with Hopsteiner lineage on both sides. It is marvelously complex with an almost understated earthy, tea-like note.","American ales and lagers","Despite its aroma-focused origins, it boasts a high alpha acid percentage. Calypso features crisp, fruity aromas and flavors that exhibit elements of apple, pear and stone fruit brightened with hints of lime citrus. ","Cascade, Belma"]
["Cascade","B / P","4,5 - 7,0",6.4,6.9,"4,5 - 7,0","33 - 40","BA","A hop with Northern Brewers Heritage","American ales and lagers","Strong spicy, floral, grapefruit character","Centennial",null,0,0,0,0,0,0,0,0,0,0,0,0]
["Centennial","P","9,5 - 11,5",null,9.4,"3,5 - 4,5","28 - 30","BA","General purpose bittering, aroma. Derived from 3/4 Brewer's Gold and contributions of Fuggle, East Kent Golding and others","American ales and Wheats","Floral, citrus aroma, spicy, clean bittering flavor","Cascade, Chinook, Columbus, Galena, Eroica, Nugget, Bullion",null,3,3.4000000000000002E-2,3.1E-2,2.9000000000000001E-2,2.5999999999999999E-2,2.4E-2,2.1999999999999999E-2,0.02,1.7999999999999999E-2,1.7000000000000001E-2,1.4999999999999999E-2,1.4E-2]
["Challenger","P","6,5 - 9,0",null,6,"3,2 - 4,2","20 - 25",null,null,null,null,null,null,6,6.5000000000000002E-2,5.8999999999999997E-2,5.3999999999999999E-2,4.9000000000000002E-2,4.4999999999999998E-2,4.1000000000000002E-2,3.7999999999999999E-2,3.5000000000000003E-2,3.2000000000000001E-2,2.9000000000000001E-2,2.5999999999999999E-2]
["Chinook","B / P","12,0 - 14,0",11.3,12.8,"3,0 - 4,0","29 - 34","Ba","Strong versatile bittering hop, but also acceptable aroma","Ales, porters, stouts","Heavy and spicy aroma. Distinct, medium intensity spice and pine characteristics with subtle notes of grapefruit","Columbus, Northern Brewer, Galena, Eroica, Nugget, Bullion",null,9,9.1999999999999998E-2,8.4000000000000005E-2,7.6999999999999999E-2,7.0000000000000007E-2,6.4000000000000001E-2,5.8999999999999997E-2,5.3999999999999999E-2,4.9000000000000002E-2,4.4999999999999998E-2,4.1000000000000002E-2,3.6999999999999998E-2]
["Citra","P","9,0 - 13,0",null,12.2,"3,5 - 4,5","22 - 24","A","Special aroma hops.\nComprised of Hallertau Mittelfrüh, US Tettnang, Brewer's Gold and East Kent Golding. Released in 2007","IPAs, strong American and Belgian Ales","Strong citrus and tropical tones of grapefruit, melon, lime, gooseberry, passion fruit and lychee","Fuggles, Willamette, Goldings",null,12,0.11600000000000001,0.106,9.7000000000000003E-2,8.7999999999999995E-2,8.1000000000000003E-2,7.3999999999999996E-2,6.8000000000000005E-2,6.2E-2,5.6000000000000001E-2,5.1999999999999998E-2,4.7E-2]
["Columbus","P","14,0 - 16,0",null,15,"4,0 - 5,0","30 - 35","B","High alpha bittering hops. Engineered Centennial Substitute, a descendant of Nugget","Pale Ale","Pungent, black pepper, licorice characteristics with subtle citrus overtones","Chinook, Northern Brewer, Nugget, Galena\nU.K. Target",null,15,0.13700000000000001,0.125,0.114,0.105,9.6000000000000002E-2,8.6999999999999994E-2,0.08,7.2999999999999995E-2,6.7000000000000004E-2,6.0999999999999999E-2,5.6000000000000001E-2]
["Crystal","P","3,5 - 5,5",null,3.7,"4,5 - 6,7","20 - 26","A","Aroma and finishing hops","IPAs and Lagers","Clean, mild, floral, pleasant and slightly spicy","Hallertauer, Mount Hood, Hersbrucker",null,18,0.156,0.14199999999999999,0.13,0.11899999999999999,0.109,9.9000000000000005E-2,9.0999999999999998E-2,8.3000000000000004E-2,7.5999999999999998E-2,6.9000000000000006E-2,6.3E-2]
["East Kent Golding","B / P","4,0 - 6,0",5.93,5.2,"1,9 - 3,0","25 - 30","BA","UK origin. The Goldings are the traditional Old English hop. Used for bittering, aroma nd dry hopping.","English style Ales, Belgian-Style Ales, Stouts, Porters, most Lagers.","Gentle, fragrant, and pleasant.","Goldings, Sovereign, Progress",null,21,0.17299999999999999,0.158,0.14399999999999999,0.13200000000000001,0.12,0.11,0.10100000000000001,9.1999999999999998E-2,8.4000000000000005E-2,7.6999999999999999E-2,7.0000000000000007E-2]
["Equinox",null,"14,4 - 15,6",null,null,"4,6 - 5,1","31,7 - 38,0","Ab","Pronounced aroma and notably high oil content","All beers","Citrus, Fruity. Noted for an indescribably unique berry-and-fresh-pepper character",null,null,24,0.187,0.17100000000000001,0.157,0.14299999999999999,0.13100000000000001,0.12,0.109,0.1,9.0999999999999998E-2,8.3000000000000004E-2,7.5999999999999998E-2]
["First Gold","P","5,6 - 9,3",null,7.5,"2,3 - 4,1","32 - 34","BA","The variety is very suitable both as a general kettle hop and also for late and dry hopping in all\ntypes of beer","All beers","Produces a well-balanced\nbitterness and a fruity, slightly spicy note in ales. An orangey quality has been observed in many\nbeers brewed using this variety.","Boadicea, Northdown, Challenger",null,27,0.20100000000000001,0.183,0.16800000000000001,0.153,0.14000000000000001,0.128,0.11700000000000001,0.107,9.8000000000000004E-2,8.8999999999999996E-2,8.2000000000000003E-2]
["Fuggles","B / P","3,5 - 6,5",6.4,4.5999999999999996,"2,0 - 4,0","27 - 33","BA","General purpose bittering/aroma.\nSelected in 1861 by Richard Fuggle","English Ales, Dark Lagers","Mild wood, soft, grassy, floral aroma","East Kent Goldings, Williamette",null,30,0.21199999999999999,0.19400000000000001,0.17699999999999999,0.16200000000000001,0.14799999999999999,0.13500000000000001,0.124,0.113,0.10299999999999999,9.4E-2,8.5999999999999993E-2]
["Galena","P","12,0 - 14,0",null,15.2,"7,0 - 9,0","37 - 42","B","General bittering hops. Strong, clean, balanced bittering. ","All beers","Spicy, blackcurrant and citrus (grapefruit) tones","Brewer's Gold, Eroica, Northern Brewer, Nugget, Columbus, Chinook",null,33,0.223,0.20300000000000001,0.186,0.17,0.155,0.14199999999999999,0.13,0.11899999999999999,0.108,9.9000000000000005E-2,9.0999999999999998E-2]
["Goldings",null,"4,0 - 6,0",null,null,"2,0 - 3,0","20 - 25","BA","Bittering, aroma and finishing.\nEast Kent Golding","British ales, bitters, porters and stouts.","Mild and delicate with sweet floral characteristics","East Kent Goldings, Fuggles, Willamette, Styrian Golding",null,36,0.23200000000000001,0.21199999999999999,0.19400000000000001,0.17699999999999999,0.16200000000000001,0.14799999999999999,0.13500000000000001,0.124,0.113,0.10299999999999999,9.4E-2]
["Hallertau Hersbrucker","P","2,0 - 5,0",null,3,"2,5 - 6,0","18 - 25","A","Very good aroma hop","Lager, Pilsner, Bock, Weizen Bock, Wheat, Belgian-Style Ales, Kölsch, Munich Helles","A mild aroma and a low co-humulone content","Strisselspalt, Hallertauter Mittelfruh",null,39,0.24,0.219,0.2,0.183,0.16700000000000001,0.153,0.14000000000000001,0.128,0.11700000000000001,0.107,9.8000000000000004E-2]
["Hallertau Mittelfrüh","B / P","3,0 - 5,5",5.2,1.5,"3,0 - 5,0","18 - 28","A","Mittelfrüh has a traditional\nEuropean aroma and is one of the Noble Hops","German Pilsner, German Style Lagers","A pleasant herbal, grassy and floral aroma","Hersbrucker",null,42,0.247,0.22600000000000001,0.20599999999999999,0.189,0.17199999999999999,0.158,0.14399999999999999,0.13200000000000001,0.12,0.11,0.10100000000000001]
["Magnum","B / P","11,0 - 16,0",12.8,14.3,"5,0 - 7,0","21 - 29","B","Bittering, no distinct aroma","Ales and Lagers","No distinct aroma","Columbus, Horizon, Nugget, German Magnum",null,45,0.253,0.23200000000000001,0.21199999999999999,0.19400000000000001,0.17699999999999999,0.16200000000000001,0.14799999999999999,0.13500000000000001,0.123,0.113,0.10299999999999999]
["Mandarina Bavaria","P","7,0 - 10,0",null,7.6,"5,0 - 6,5","31 - 35",null,null,null,null,null,null,48,0.25900000000000001,0.23699999999999999,0.216,0.19800000000000001,0.18099999999999999,0.16500000000000001,0.151,0.13800000000000001,0.126,0.115,0.105]
["Mosaic","P","11,5 - 13,5",null,11.7,"3,2 - 3,9","24 - 26","A","An excellent aroma variety. Daughter of Simcoe","IPAs","A complex array of tropical fruit, citrus, berry, herbal, earthy and pine characteristics",null,null,51,0.26400000000000001,0.24099999999999999,0.221,0.20200000000000001,0.184,0.16900000000000001,0.154,0.14099999999999999,0.129,0.11799999999999999,0.108]
["Mount Hood","P","4,0 - 8,0",null,5.2,"5,0 - 7,5","22 - 27"]
["Northern Brewer","B / P","7,0 - 10,0",9.9,9.9,"3,5 - 5,0","27 - 33","BA","A true dual purpose hop variety","Ales","Medium intensity, pine and mint characteristics","Chinook, US Northern Brewer, Galena",null,54,0.26900000000000002,0.246,0.224,0.20499999999999999,0.188,0.17100000000000001,0.157,0.14299999999999999,0.13100000000000001,0.12,0.109]
["Nugget","P","12,0 - 14,5",null,13.2,"4,0 - 6,0","22 - 26","Ba","Bittering, but gaining acceptance as a dual purpose variety","Barley Wine","Mild and pleasant with spicy, herbal tones","Columbus, Galena, Magnum",null,57,0.27300000000000002,0.249,0.22800000000000001,0.20799999999999999,0.19,0.17399999999999999,0.159,0.14499999999999999,0.13300000000000001,0.121,0.111]
["Perle","B / P","6,0 - 10,0",9.1,4,"2,5 - 5,0","28 - 32","BA","Bred from English Northern Brewer. Often used as a dual purpose hop in a variety of applications","Stout","Slightly spicy with herbal and floral characteristics","Northern Brewer, German Northern Brewer, German Perle",null,60,0.27600000000000002,0.252,0.23100000000000001,0.21099999999999999,0.193,0.17599999999999999,0.161,0.14699999999999999,0.13500000000000001,0.123,0.112]
["Saaz","B / P","3,0 - 4,5",2.2000000000000002,3.5,"3,0 - 4,5","24 - 28","A","The classic \"noble\" aroma hop with long and strong traditions, associated with the renowned pilsner lager","Lagers","Very mild, with pleasant earthy, herbal and floral overtones","US Saaz, Sterling, Polish Lublin",null,70,0.28499999999999998,0.26100000000000001,0.23799999999999999,0.218,0.19900000000000001,0.182,0.16600000000000001,0.152,0.13900000000000001,0.127,0.11600000000000001]
["Simcoe","P","12,0 - 14,0",null,12.6,"4,0 - 5,0","15 - 20","BA","Known as a bittering hop with a good aroma. Dual Purpose","IPAs","Unique passionfruit, pine, earth and citrus characteristics","Magnum, Summit",null,80,0.29099999999999998,0.26600000000000001,0.24299999999999999,0.222,0.20300000000000001,0.186,0.17,0.155,0.14199999999999999,0.13,0.11899999999999999]
["Sorachi Ace",null,"11,5 - 14,5",null,null,"6,0 - 7,5","25 - 28",null,null,null,null,null,null,90,0.29499999999999998,0.27,0.247,0.22600000000000001,0.20599999999999999,0.188,0.17199999999999999,0.157,0.14399999999999999,0.13200000000000001,0.12]
["Styrian Golding","B / P","2,8 - 5,5",3.2,3.5,"2,0 - 3,0","25 - 30","A","A world-renowned aroma hop with widespread usage in both ale and lager brewing","Belgian-style Ales","Very mild, noble hop flavor","Fuggle, Styrian Bobek",null,120,0.30099999999999999,0.27500000000000002,0.252,0.23,0.21,0.192,0.17599999999999999,0.161,0.14699999999999999,0.13400000000000001,0.123]
["Summit","P","15,0 - 17,0",null,15.6,"5,0 - 6,5","29 - 32","Ba","Mainly used as a bittering hop, but does have earthy aromatic characteristics and subtle hints of citrus.","American ales and lagers","Specific aroma descriptors include pepper, incense, anise, orange, pink grapefruit and tangerine."]
["Target","B / P","8,5 - 13,5",7.8,9.1999999999999993,"4,0 - 5,7",37,"B","An excellent bittering hop that tends to be too harsh for aroma purposes late in the boil","Ale","An intense English hop aroma with distinct spicy, floral, sage and citrus characteristics","Fuggle, Willamette"]
["Tettnanger","B / P","3,0 - 6,0",4.8,3.5,"3,0 - 5,0","22 - 29","A","Traditional noble aroma hop","Belgian-style Ales","Mild and pleasant with balanced earthy, herbal and floral aroma impressions","Saaz, Hersbrucker, Spalt, Select",null,"To calculate IBUs, the formula is simple:",null,null,null,null,null,null,"IBUs = decimal alpha acid utilization * mg/l of added alpha acids"]
["Tradition","P","5,0 - 7,0",null,5.5,"4,0 - 5,0","26 - 29","A","Aroma Hop. Imparts beer with a harmonic bitterness","Bock","Medium intense floral and herbal (grassy) tones","Liberty, Hallertau Mittelfrüh"]
["Willamette","P","4,0 - 6,0",null,4.5,"3,0 - 4,5","30 - 35","A","A quality aroma hop with low alpha content. Triploid seedling of the English Fuggle variety","English-style Ale","Mild and pleasant, with slightly spicy and floral tones","Fuggle, Glacier, Tettnanger, Styrian Golding",null,"To calculate the concentration of alpha acids you add to the wort:",null,null,null,null,null,null,"(mg/l of added alpha acids = decimal AA rating * grams hops * 1000) / volume of finished beer in liters"]
[]
[]
[]
["https://ychhops.com/varieties"]
[]
["Humlesorter i Blomster",{"$f":"COUNTIF(B3:B38,\"*B*\")","v":13}]
["Humlesorter i Pellets",{"$f":"COUNTIF(B3:B38,\"*P*\")","v":32}]

{"sheet":"Humle X-ref.","index":8,"n_rows":83,"n_cols":3,"rows_kept":83,"cut":false,"hidden":false,"merged":[]}
["HUMLE","Forslag fra 'hjemmebryg.things-4-you'","Forslag fra Humle arket (samlet fra forskellige sites)"]
["Admiral"," Rakau, Pilgrim",{"$f":"IFERROR(IF(VLOOKUP(A2,Humle!$A$4:$L$38,12,FALSE)=0,\"\",VLOOKUP(A2,Humle!$A$4:$L$38,12,FALSE)),\"\")","v":""}]
["Ahtanum"," Amarillo, Cascade, Centennial",{"$f":"IFERROR(IF(VLOOKUP(A3,Humle!$A$4:$L$38,12,FALSE)=0,\"\",VLOOKUP(A3,Humle!$A$4:$L$38,12,FALSE)),\"\")","v":""}]
["Amarillo"," Ahtanum, Cascade, Centennial",{"$f":"IFERROR(IF(VLOOKUP(A4,Humle!$A$4:$L$38,12,FALSE)=0,\"\",VLOOKUP(A4,Humle!$A$4:$L$38,12,FALSE)),\"\")","v":"Cascade, Centennial, Simcoe"}]
["Aramis"," Challenger, Ahtanum",{"$f":"IFERROR(IF(VLOOKUP(A5,Humle!$A$4:$L$38,12,FALSE)=0,\"\",VLOOKUP(A5,Humle!$A$4:$L$38,12,FALSE)),\"\")","v":""}]
["Boadicea"," Challenger, Sovereign, Golding",{"$f":"IFERROR(IF(VLOOKUP(A6,Humle!$A$4:$L$38,12,FALSE)=0,\"\",VLOOKUP(A6,Humle!$A$4:$L$38,12,FALSE)),\"\")","v":""}]
["Bobek"," Cascade",{"$f":"IFERROR(IF(VLOOKUP(A7,Humle!$A$4:$L$38,12,FALSE)=0,\"\",VLOOKUP(A7,Humle!$A$4:$L$38,12,FALSE)),\"\")","v":""}]
["Bouclier"," Tetnanger, Spalt Select, Tradition",{"$f":"IFERROR(IF(VLOOKUP(A8,Humle!$A$4:$L$38,12,FALSE)=0,\"\",VLOOKUP(A8,Humle!$A$4:$L$38,12,FALSE)),\"\")","v":""}]
["Bramling Cross"," Willamette",{"$f":"IFERROR(IF(VLOOKUP(A9,Humle!$A$4:$L$38,12,FALSE)=0,\"\",VLOOKUP(A9,Humle!$A$4:$L$38,12,FALSE)),\"\")","v":""}]
["Bravo"," Nugget, Simcoe",{"$f":"IFERROR(IF(VLOOKUP(A10,Humle!$A$4:$L$38,12,FALSE)=0,\"\",VLOOKUP(A10,Humle!$A$4:$L$38,12,FALSE)),\"\")","v":""}]
["Brewers Gold"," Northern Brewer, North Down, Pioneer",{"$f":"IFERROR(IF(VLOOKUP(A11,Humle!$A$4:$L$38,12,FALSE)=0,\"\",VLOOKUP(A11,Humle!$A$4:$L$38,12,FALSE)),\"\")","v":""}]
["Bullion"," Northern Brewer, Brewers Gold, Columbus, Tomahawk",{"$f":"IFERROR(IF(VLOOKUP(A12,Humle!$A$4:$L$38,12,FALSE)=0,\"\",VLOOKUP(A12,Humle!$A$4:$L$38,12,FALSE)),\"\")","v":""}]
["Calypso"," Cascade, Belma",{"$f":"IFERROR(IF(VLOOKUP(A13,Humle!$A$4:$L$38,12,FALSE)=0,\"\",VLOOKUP(A13,Humle!$A$4:$L$38,12,FALSE)),\"\")","v":"Cascade, Belma"}]
["Cascade"," Palisade, Ahtanum, Amarillo, Centennial",{"$f":"IFERROR(IF(VLOOKUP(A14,Humle!$A$4:$L$38,12,FALSE)=0,\"\",VLOOKUP(A14,Humle!$A$4:$L$38,12,FALSE)),\"\")","v":"Centennial"}]
["Centennial"," Cascade, Chinook, Columbus, Tomahawk",{"$f":"IFERROR(IF(VLOOKUP(A15,Humle!$A$4:$L$38,12,FALSE)=0,\"\",VLOOKUP(A15,Humle!$A$4:$L$38,12,FALSE)),\"\")","v":"Cascade, Chinook, Columbus, Galena, Eroica, Nugget, Bullion"}]
["Challenger"," Northern Brewer, First Gold, Northdown",{"$f":"IFERROR(IF(VLOOKUP(A16,Humle!$A$4:$L$38,12,FALSE)=0,\"\",VLOOKUP(A16,Humle!$A$4:$L$38,12,FALSE)),\"\")","v":""}]
["Chinook"," Columbus, Tomahawk, Nugget, Simcoe",{"$f":"IFERROR(IF(VLOOKUP(A17,Humle!$A$4:$L$38,12,FALSE)=0,\"\",VLOOKUP(A17,Humle!$A$4:$L$38,12,FALSE)),\"\")","v":"Columbus, Northern Brewer, Galena, Eroica, Nugget, Bullion"}]
["Citra"," Fuggle, Willamette, Goldings",{"$f":"IFERROR(IF(VLOOKUP(A18,Humle!$A$4:$L$38,12,FALSE)=0,\"\",VLOOKUP(A18,Humle!$A$4:$L$38,12,FALSE)),\"\")","v":"Fuggles, Willamette, Goldings"}]
["Cluster"," Willamette, Galena",{"$f":"IFERROR(IF(VLOOKUP(A19,Humle!$A$4:$L$38,12,FALSE)=0,\"\",VLOOKUP(A19,Humle!$A$4:$L$38,12,FALSE)),\"\")","v":""}]
["Columbus"," Tomahawk, Nugget, Simcoe, Chinook",{"$f":"IFERROR(IF(VLOOKUP(A20,Humle!$A$4:$L$38,12,FALSE)=0,\"\",VLOOKUP(A20,Humle!$A$4:$L$38,12,FALSE)),\"\")","v":"Chinook, Northern Brewer, Nugget, Galena\nU.K. Target"}]
["Crystal"," Liberty, Mount Hood",{"$f":"IFERROR(IF(VLOOKUP(A21,Humle!$A$4:$L$38,12,FALSE)=0,\"\",VLOOKUP(A21,Humle!$A$4:$L$38,12,FALSE)),\"\")","v":"Hallertauer, Mount Hood, Hersbrucker"}]
["Delta"," Fuggle, Willamette",{"$f":"IFERROR(IF(VLOOKUP(A22,Humle!$A$4:$L$38,12,FALSE)=0,\"\",VLOOKUP(A22,Humle!$A$4:$L$38,12,FALSE)),\"\")","v":""}]
["East Kent Gold"," Progress, Sovereign, Golding",{"$f":"IFERROR(IF(VLOOKUP(A23,Humle!$A$4:$L$38,12,FALSE)=0,\"\",VLOOKUP(A23,Humle!$A$4:$L$38,12,FALSE)),\"\")","v":""}]
["Endeavour"," Northern Brewer",{"$f":"IFERROR(IF(VLOOKUP(A24,Humle!$A$4:$L$38,12,FALSE)=0,\"\",VLOOKUP(A24,Humle!$A$4:$L$38,12,FALSE)),\"\")","v":""}]
["First Gold"," Challenger, Northern Brewer, Northdown, Boadicea",{"$f":"IFERROR(IF(VLOOKUP(A25,Humle!$A$4:$L$38,12,FALSE)=0,\"\",VLOOKUP(A25,Humle!$A$4:$L$38,12,FALSE)),\"\")","v":"Boadicea, Northdown, Challenger"}]
["Fuggle"," Styrian Golding, Willamette, Progress, Sovereign, Golding",{"$f":"IFERROR(IF(VLOOKUP(A26,Humle!$A$4:$L$38,12,FALSE)=0,\"\",VLOOKUP(A26,Humle!$A$4:$L$38,12,FALSE)),\"\")","v":""}]
["Galaxy"," Cascade, Amarillo, Citra",{"$f":"IFERROR(IF(VLOOKUP(A27,Humle!$A$4:$L$38,12,FALSE)=0,\"\",VLOOKUP(A27,Humle!$A$4:$L$38,12,FALSE)),\"\")","v":""}]
["Galena"," Nugget, Target",{"$f":"IFERROR(IF(VLOOKUP(A28,Humle!$A$4:$L$38,12,FALSE)=0,\"\",VLOOKUP(A28,Humle!$A$4:$L$38,12,FALSE)),\"\")","v":"Brewer's Gold, Eroica, Northern Brewer, Nugget, Columbus, Chinook"}]
["Golding"," East Kent Golding, Progress",{"$f":"IFERROR(IF(VLOOKUP(A29,Humle!$A$4:$L$38,12,FALSE)=0,\"\",VLOOKUP(A29,Humle!$A$4:$L$38,12,FALSE)),\"\")","v":""}]
["Green Bullet"," Centennial",{"$f":"IFERROR(IF(VLOOKUP(A30,Humle!$A$4:$L$38,12,FALSE)=0,\"\",VLOOKUP(A30,Humle!$A$4:$L$38,12,FALSE)),\"\")","v":""}]
["Hallertauer Mittlefrüh"," Hersbrucker",{"$f":"IFERROR(IF(VLOOKUP(A31,Humle!$A$4:$L$38,12,FALSE)=0,\"\",VLOOKUP(A31,Humle!$A$4:$L$38,12,FALSE)),\"\")","v":""}]
["Hersbrucker"," Strisselspalt, Hallertauer Mittlefrüh",{"$f":"IFERROR(IF(VLOOKUP(A32,Humle!$A$4:$L$38,12,FALSE)=0,\"\",VLOOKUP(A32,Humle!$A$4:$L$38,12,FALSE)),\"\")","v":""}]
["Horizon"," Magnum",{"$f":"IFERROR(IF(VLOOKUP(A33,Humle!$A$4:$L$38,12,FALSE)=0,\"\",VLOOKUP(A33,Humle!$A$4:$L$38,12,FALSE)),\"\")","v":""}]
["Junga"," Nugget, Target, Galena",{"$f":"IFERROR(IF(VLOOKUP(A34,Humle!$A$4:$L$38,12,FALSE)=0,\"\",VLOOKUP(A34,Humle!$A$4:$L$38,12,FALSE)),\"\")","v":""}]
["Kazbek"," Saaz, Sterling",{"$f":"IFERROR(IF(VLOOKUP(A35,Humle!$A$4:$L$38,12,FALSE)=0,\"\",VLOOKUP(A35,Humle!$A$4:$L$38,12,FALSE)),\"\")","v":""}]
["Liberty"," Crystal, Mount Hood, Traditional",{"$f":"IFERROR(IF(VLOOKUP(A36,Humle!$A$4:$L$38,12,FALSE)=0,\"\",VLOOKUP(A36,Humle!$A$4:$L$38,12,FALSE)),\"\")","v":""}]
["Lubelski"," Styrian Golding, Saaz",{"$f":"IFERROR(IF(VLOOKUP(A37,Humle!$A$4:$L$38,12,FALSE)=0,\"\",VLOOKUP(A37,Humle!$A$4:$L$38,12,FALSE)),\"\")","v":""}]
["Magnum"," Nugget, Columbus, Tomahawk, Pilgrim, Target",{"$f":"IFERROR(IF(VLOOKUP(A38,Humle!$A$4:$L$38,12,FALSE)=0,\"\",VLOOKUP(A38,Humle!$A$4:$L$38,12,FALSE)),\"\")","v":"Columbus, Horizon, Nugget, German Magnum"}]
["Marynka"," Northern Brewer",{"$f":"IFERROR(IF(VLOOKUP(A39,Humle!$A$4:$L$38,12,FALSE)=0,\"\",VLOOKUP(A39,Humle!$A$4:$L$38,12,FALSE)),\"\")","v":""}]
["Millenium"," Nugget, Columbus, Tomahawk",{"$f":"IFERROR(IF(VLOOKUP(A40,Humle!$A$4:$L$38,12,FALSE)=0,\"\",VLOOKUP(A40,Humle!$A$4:$L$38,12,FALSE)),\"\")","v":""}]
["Mosaic"," Nugget, Simcoe",{"$f":"IFERROR(IF(VLOOKUP(A41,Humle!$A$4:$L$38,12,FALSE)=0,\"\",VLOOKUP(A41,Humle!$A$4:$L$38,12,FALSE)),\"\")","v":""}]
["Mount Hood"," Hersbrucker, Strisselspalt, Crystal",{"$f":"IFERROR(IF(VLOOKUP(A42,Humle!$A$4:$L$38,12,FALSE)=0,\"\",VLOOKUP(A42,Humle!$A$4:$L$38,12,FALSE)),\"\")","v":""}]
["Newport"," Nugget, Galena, Magnum",{"$f":"IFERROR(IF(VLOOKUP(A43,Humle!$A$4:$L$38,12,FALSE)=0,\"\",VLOOKUP(A43,Humle!$A$4:$L$38,12,FALSE)),\"\")","v":""}]
["Northdown"," Challenger, Northern Brewer, First Gold",{"$f":"IFERROR(IF(VLOOKUP(A44,Humle!$A$4:$L$38,12,FALSE)=0,\"\",VLOOKUP(A44,Humle!$A$4:$L$38,12,FALSE)),\"\")","v":""}]
["Northern Brewer"," Northdown, Challenger, Brewers Gold, First Gold, Perle",{"$f":"IFERROR(IF(VLOOKUP(A45,Humle!$A$4:$L$38,12,FALSE)=0,\"\",VLOOKUP(A45,Humle!$A$4:$L$38,12,FALSE)),\"\")","v":"Chinook, US Northern Brewer, Galena"}]
["Nugget"," Target, Galena, Magnum, Columbus, Tomahawk, Chinook, Simcoe",{"$f":"IFERROR(IF(VLOOKUP(A46,Humle!$A$4:$L$38,12,FALSE)=0,\"\",VLOOKUP(A46,Humle!$A$4:$L$38,12,FALSE)),\"\")","v":"Columbus, Galena, Magnum"}]
["Pacifica"," Hersbrucker, Cluster",{"$f":"IFERROR(IF(VLOOKUP(A47,Humle!$A$4:$L$38,12,FALSE)=0,\"\",VLOOKUP(A47,Humle!$A$4:$L$38,12,FALSE)),\"\")","v":""}]
["Palisade"," Cascade",{"$f":"IFERROR(IF(VLOOKUP(A48,Humle!$A$4:$L$38,12,FALSE)=0,\"\",VLOOKUP(A48,Humle!$A$4:$L$38,12,FALSE)),\"\")","v":""}]
["Perle"," North Down, Northern Brewer, First Gold",{"$f":"IFERROR(IF(VLOOKUP(A49,Humle!$A$4:$L$38,12,FALSE)=0,\"\",VLOOKUP(A49,Humle!$A$4:$L$38,12,FALSE)),\"\")","v":"Northern Brewer, German Northern Brewer, German Perle"}]
["Phoenix"," Challenger",{"$f":"IFERROR(IF(VLOOKUP(A50,Humle!$A$4:$L$38,12,FALSE)=0,\"\",VLOOKUP(A50,Humle!$A$4:$L$38,12,FALSE)),\"\")","v":""}]
["Pilgrim"," Admiral, Target",{"$f":"IFERROR(IF(VLOOKUP(A51,Humle!$A$4:$L$38,12,FALSE)=0,\"\",VLOOKUP(A51,Humle!$A$4:$L$38,12,FALSE)),\"\")","v":""}]
["Pioneer"," Brewers Gold, East Kent Goldings",{"$f":"IFERROR(IF(VLOOKUP(A52,Humle!$A$4:$L$38,12,FALSE)=0,\"\",VLOOKUP(A52,Humle!$A$4:$L$38,12,FALSE)),\"\")","v":""}]
["Premiant"," Crystal, Mount Hood, Traditional",{"$f":"IFERROR(IF(VLOOKUP(A53,Humle!$A$4:$L$38,12,FALSE)=0,\"\",VLOOKUP(A53,Humle!$A$4:$L$38,12,FALSE)),\"\")","v":""}]
["Progress"," East Kent Goldings",{"$f":"IFERROR(IF(VLOOKUP(A54,Humle!$A$4:$L$38,12,FALSE)=0,\"\",VLOOKUP(A54,Humle!$A$4:$L$38,12,FALSE)),\"\")","v":""}]
["Rakau"," Amarillo, Admiral, Summit",{"$f":"IFERROR(IF(VLOOKUP(A55,Humle!$A$4:$L$38,12,FALSE)=0,\"\",VLOOKUP(A55,Humle!$A$4:$L$38,12,FALSE)),\"\")","v":""}]
["Riwaka"," Saaz, Sterling",{"$f":"IFERROR(IF(VLOOKUP(A56,Humle!$A$4:$L$38,12,FALSE)=0,\"\",VLOOKUP(A56,Humle!$A$4:$L$38,12,FALSE)),\"\")","v":""}]
["Santiam"," Tettnanger, Spalt Select",{"$f":"IFERROR(IF(VLOOKUP(A57,Humle!$A$4:$L$38,12,FALSE)=0,\"\",VLOOKUP(A57,Humle!$A$4:$L$38,12,FALSE)),\"\")","v":""}]
["Savinjski Golding"," Tettnanger, Fuggle, Saaz",{"$f":"IFERROR(IF(VLOOKUP(A58,Humle!$A$4:$L$38,12,FALSE)=0,\"\",VLOOKUP(A58,Humle!$A$4:$L$38,12,FALSE)),\"\")","v":""}]
["Simcoe"," Columbus, Tomahawk, Nugget, Summit, Chinook",{"$f":"IFERROR(IF(VLOOKUP(A59,Humle!$A$4:$L$38,12,FALSE)=0,\"\",VLOOKUP(A59,Humle!$A$4:$L$38,12,FALSE)),\"\")","v":"Magnum, Summit"}]
["Sladek"," Crystal, Mount Hood, Traditional",{"$f":"IFERROR(IF(VLOOKUP(A60,Humle!$A$4:$L$38,12,FALSE)=0,\"\",VLOOKUP(A60,Humle!$A$4:$L$38,12,FALSE)),\"\")","v":""}]
["Sonnet"," Golding",{"$f":"IFERROR(IF(VLOOKUP(A61,Humle!$A$4:$L$38,12,FALSE)=0,\"\",VLOOKUP(A61,Humle!$A$4:$L$38,12,FALSE)),\"\")","v":""}]
["Sorachi ACE"," Columbus, Tomahawk, Summit, Warrior, Chinook",{"$f":"IFERROR(IF(VLOOKUP(A62,Humle!$A$4:$L$38,12,FALSE)=0,\"\",VLOOKUP(A62,Humle!$A$4:$L$38,12,FALSE)),\"\")","v":""}]
["Southern Cross"," Northern Brewer, Chinook",{"$f":"IFERROR(IF(VLOOKUP(A63,Humle!$A$4:$L$38,12,FALSE)=0,\"\",VLOOKUP(A63,Humle!$A$4:$L$38,12,FALSE)),\"\")","v":""}]
["Sovereign"," Golding",{"$f":"IFERROR(IF(VLOOKUP(A64,Humle!$A$4:$L$38,12,FALSE)=0,\"\",VLOOKUP(A64,Humle!$A$4:$L$38,12,FALSE)),\"\")","v":""}]
["Spalt Select"," Tetnanger, Saaz",{"$f":"IFERROR(IF(VLOOKUP(A65,Humle!$A$4:$L$38,12,FALSE)=0,\"\",VLOOKUP(A65,Humle!$A$4:$L$38,12,FALSE)),\"\")","v":""}]
["Sterling"," Saaz",{"$f":"IFERROR(IF(VLOOKUP(A66,Humle!$A$4:$L$38,12,FALSE)=0,\"\",VLOOKUP(A66,Humle!$A$4:$L$38,12,FALSE)),\"\")","v":""}]
["Sticklebract"," Northern Brewer",{"$f":"IFERROR(IF(VLOOKUP(A67,Humle!$A$4:$L$38,12,FALSE)=0,\"\",VLOOKUP(A67,Humle!$A$4:$L$38,12,FALSE)),\"\")","v":""}]
["Strisselspalt"," Hersbrucker",{"$f":"IFERROR(IF(VLOOKUP(A68,Humle!$A$4:$L$38,12,FALSE)=0,\"\",VLOOKUP(A68,Humle!$A$4:$L$38,12,FALSE)),\"\")","v":""}]
["Styrian Golding"," Spalt Select, Tradition",{"$f":"IFERROR(IF(VLOOKUP(A69,Humle!$A$4:$L$38,12,FALSE)=0,\"\",VLOOKUP(A69,Humle!$A$4:$L$38,12,FALSE)),\"\")","v":"Fuggle, Styrian Bobek"}]
["Summit"," Columbus, Tommahawk, Simcoe, Chinook, Nugget",{"$f":"IFERROR(IF(VLOOKUP(A70,Humle!$A$4:$L$38,12,FALSE)=0,\"\",VLOOKUP(A70,Humle!$A$4:$L$38,12,FALSE)),\"\")","v":""}]
["Sussex"," Fuggle",{"$f":"IFERROR(IF(VLOOKUP(A71,Humle!$A$4:$L$38,12,FALSE)=0,\"\",VLOOKUP(A71,Humle!$A$4:$L$38,12,FALSE)),\"\")","v":""}]
["Sybilla"," Nugget, Challenger, Northern Brewer, Progress, Perle",{"$f":"IFERROR(IF(VLOOKUP(A72,Humle!$A$4:$L$38,12,FALSE)=0,\"\",VLOOKUP(A72,Humle!$A$4:$L$38,12,FALSE)),\"\")","v":""}]
["Saaz"," Tettnanger, Lubelski",{"$f":"IFERROR(IF(VLOOKUP(A73,Humle!$A$4:$L$38,12,FALSE)=0,\"\",VLOOKUP(A73,Humle!$A$4:$L$38,12,FALSE)),\"\")","v":"US Saaz, Sterling, Polish Lublin"}]
["Target"," Magnum, Pilgrim",{"$f":"IFERROR(IF(VLOOKUP(A74,Humle!$A$4:$L$38,12,FALSE)=0,\"\",VLOOKUP(A74,Humle!$A$4:$L$38,12,FALSE)),\"\")","v":"Fuggle, Willamette"}]
["Tettnanger"," Spalt Select, Saaz",{"$f":"IFERROR(IF(VLOOKUP(A75,Humle!$A$4:$L$38,12,FALSE)=0,\"\",VLOOKUP(A75,Humle!$A$4:$L$38,12,FALSE)),\"\")","v":"Saaz, Hersbrucker, Spalt, Select"}]
["Tomahawk"," Columbus, Nugget, Simcoe, Chinook",{"$f":"IFERROR(IF(VLOOKUP(A76,Humle!$A$4:$L$38,12,FALSE)=0,\"\",VLOOKUP(A76,Humle!$A$4:$L$38,12,FALSE)),\"\")","v":""}]
["Topaz"," Columbus, Tomahawk, Summit",{"$f":"IFERROR(IF(VLOOKUP(A77,Humle!$A$4:$L$38,12,FALSE)=0,\"\",VLOOKUP(A77,Humle!$A$4:$L$38,12,FALSE)),\"\")","v":""}]
["Tradition"," Hersbrucker",{"$f":"IFERROR(IF(VLOOKUP(A78,Humle!$A$4:$L$38,12,FALSE)=0,\"\",VLOOKUP(A78,Humle!$A$4:$L$38,12,FALSE)),\"\")","v":"Liberty, Hallertau Mittelfrüh"}]
["Vanguard"," Hersbrucker, Liberty, Mount Hood",{"$f":"IFERROR(IF(VLOOKUP(A79,Humle!$A$4:$L$38,12,FALSE)=0,\"\",VLOOKUP(A79,Humle!$A$4:$L$38,12,FALSE)),\"\")","v":""}]
["Warrior"," Nugget, Columbus, Magnum",{"$f":"IFERROR(IF(VLOOKUP(A80,Humle!$A$4:$L$38,12,FALSE)=0,\"\",VLOOKUP(A80,Humle!$A$4:$L$38,12,FALSE)),\"\")","v":""}]
["WGV"," Challenger, Sovereign, Golding",{"$f":"IFERROR(IF(VLOOKUP(A81,Humle!$A$4:$L$38,12,FALSE)=0,\"\",VLOOKUP(A81,Humle!$A$4:$L$38,12,FALSE)),\"\")","v":""}]
["Willamette"," Bramling Cross, Fuggle, Progress, Sovereign, golding",{"$f":"IFERROR(IF(VLOOKUP(A82,Humle!$A$4:$L$38,12,FALSE)=0,\"\",VLOOKUP(A82,Humle!$A$4:$L$38,12,FALSE)),\"\")","v":"Fuggle, Glacier, Tettnanger, Styrian Golding"}]
["Åpollo"," Columbus, Tomahawk, Magnum",{"$f":"IFERROR(IF(VLOOKUP(A83,Humle!$A$4:$L$38,12,FALSE)=0,\"\",VLOOKUP(A83,Humle!$A$4:$L$38,12,FALSE)),\"\")","v":""}]

{"sheet":"Tilsætninger","index":9,"n_rows":24,"n_cols":5,"rows_kept":24,"cut":false,"hidden":false,"merged":[]}
["Tilsætninger","EBC","EBC Avg.","Udbytte"]
["Sukker",0,0,440]
["Rørsukker","20 - 30",25,420]
["Farin","50 - 75",65,420]
["Muscovado Sukker","80 - 120",100,400]
["Mørk Kandis","80 - 120",80,375]
["Lys Kandis",0,0,375]
["Dansk Honning",40,40,375]
["Appelsinskal",0,0,0]
["Koriander",0,0,0]
["Stjerneanis",0,0,0]
["Kanel",0,0,0]
["Lakrids",0,100,0,"Estimat"]
["Lakridsrod",0,0,0]
["Chili Flakes",0,0,0]
["Ege Chips",0,0,0]
["Ekstra lys spraymalt",8,8,420,"Estimat"]
["Hvede spraymalt",8,8,420,"Estimat"]
["Lys spraymalt",12,12,420,"Estimat"]
["Medium spraymalt",18,18,420,"Estimat"]
["Mørk spraymalt",57,57,420,"Estimat"]
["Vanilie",0,0,0]
["Ekstra mørk spraymalt",95,95,420,"Estimat"]
["Klar Urt",0,0,0]

{"sheet":"Gær","index":10,"n_rows":69,"n_cols":10,"rows_kept":69,"cut":false,"hidden":false,"merged":[[66,2,66,5],[68,2,68,5]]}
["Gær Navn","Beskrivelse","Flocculation","Attenuation %","Attenuation Avg.","Temp. Range °C","Alc. Tolerance %",null,"Temp.(°C)","CO2"]
[null,null,null,null,null,null,null,null,0,1.71]
[" - Brewolution Abbey Ale","Den har en fantastisk og kraftig frugtaroma, balanceret perfekt med en mild og let krydret aroma, og komplekse og lækre krydrede phenoler.","Medium - High","73 - 77",75,"18 - 25",8,null,1,1.66]
["Brewolution American Ale","Denne gær giver en usædvanlig ren smag, ideel til at humlekarakteren kommer tydelig frem. Citrus og fyrresmag i humle vil blive fremhævet.","High","77 - 85",81,"18 - 23",10,null,2,1.61]
["Brewolution Belgian Strong Ale","Meget karakterfuld ølgær med krydrede, frugtige og pebrede noter.","Medium","85 - 90",90,"26 - 32",12,null,3,1.56]
["Brewolution British Ale","Gæren har en neutral gæraroma for at sikre, den fulde karakter af malt og humle er fremtrædende i hver øl.","Very High","77 - 82",80,"16 - 22",12,null,4,1.51]
["Brewolution Dark Ale","Fremmer krop og smag. Gæren giver en fyldig mørk frugt variation.","High","70 - 75",73,"18 - 22",8,null,5,1.46]
["Brewolution Universal Lager","Denne gær giver en blød, delikat og velafbalanceret øl, med en tør og ren smag.","High","72 - 76",77,"10 - 15",8,null,6,1.39]
["Brewolution Wheat Beer","Giver fine velafbalancerede estere med krydrede aromaer. Klassiske banan estere","Low","70 - 75",73,"18 - 30",7.5,null,7,1.32]
["- Mangrove Jack's Bohemian Lager M84","Denne gær giver en blød, delikat og velafbalanceret øl, med en tør og ren smag.","High","72 - 76",77,"10 - 15",8,null,8,1.28]
["Mangrove Jack's Californian Lager M54","Producer en ren og klar pilsneraroma, uden de frygtede bismage. Gæren er perfekt til de fleste undergærede øltyper.","Medium - High","77 - 82",80,"18 - 20",9,null,9,1.24]
["- Mangrove Jack's Belgian Abbey Ale M47","Den har en fantastisk og kraftig frugtaroma, balanceret perfekt med en mild og let krydret aroma, og komplekse og lækre krydrede phenoler.","Medium - High","73 - 77",75,"18 - 25",8,null,10,1.2]
["- Mangrove Jack's Bavarian Wheat M20","Giver fine velafbalancerede estere med krydrede aromaer. Klassiske banan estere","Low","70 - 75",73,"18 - 30",7.5,null,11,1.17]
["Mangrove Jack's Liberty Bell Ale M36","Ren, neutral og rund I smagen, let pæreagtig aroma, med lidt jordbær eller kiwi blandet i. Rene klare maltaromaer, og med en evne til at fremhæve humlearomaerne","High","74 - 78",76,"18 - 23",9,null,12,1.1299999999999999]
["- Mangrove Jack´s French Saison M29","Meget karakterfuld ølgær med krydrede, frugtige og pebrede noter.","Medium","85 - 90",90,"26 - 32",12,null,13,1.0900000000000001]
["- Mangrove Jack´s New World Strong Ale M42","Gæren har en neutral gæraroma for at sikre, den fulde karakter af malt og humle er fremtrædende i hver øl. Giver en meget klar øl, da gærrester lægger sig fast i bunden og blander sig ikke ved uro i væsken.","Very High","77 - 82",79,"16 - 22",12,null,14,1.05]
["- Mangrove Jack's Newcastle Dark Ale M03","Fremmer krop og smag. Gæren giver en fyldig mørk frugt variation.","High","70 - 75",73,"18 - 22",8,null,15,1.02]
["Mangrove Jack's US West Coast M44 (500g)","Denne gær giver en usædvanlig ren smag, ideel til at humlekarakteren kommer tydelig frem. Citrus og fyrresmag i humle vil blive fremhævet.","High","77 - 85",81,"18 - 23",10,null,16,0.99]
["- Mangrove Jack's Workhorse M10","Neutral og ren aroma, der er velegnet til alle øltyper. Imiterer lagerøl karakteristika.","Medium","High",75,"15 - 32",8,null,17,0.95]
["Wyeast XL1007 German Ale",null,"Low","73 - 77",75,"13 - 20",11,null,18,0.91]
["Wyeast XL1010 American Wheat",null,"Low","74 - 78",76,"14 - 23",10,null,19,0.89]
["Wyeast XL1028 London Ale",null,"Low - Medium","73 - 77",75,"15 - 22",11,null,20,0.88]
["Wyeast XL1056 American Ale","Well balanced. Ferments dry, finishes soft.","Low - Medium","73 - 77",75,"15 - 22",11,null,21,0.85]
["Wyeast XL1084 Irish Ale",null,"Medium","71 - 75",73,"16 - 22",12,null,22,0.83]
["Wyeast XL1098 British Ale",null,"Medium","73 - 75",74,"18 - 22",10,null,23,0.81]
["Wyeast XL1099 Whitbread Ale",null,"Medium - High","68 - 72",70,"18 - 24",10,null,24,0.78]
["Wyeast XL1187 Ringwood Ale","A malty, complex profile that clears well.","High","68 - 72",70,"18 - 23",10,null,25,0.76]
["Wyeast XL1214 Belgian Abbey",null,"Low - Medium","74 - 78",76,"20 - 24",12,null,26,0.74]
["Wyeast XL1272 American Ale II","Slightly nutty, soft, clean and tart finish.","Medium","72 - 76",74,"15 - 22",10,null,27,0.73]
["Wyeast XL1275 Thames Valley Ale",null,"Low - Medium","72 - 76",74,"16 - 22",10]
["Wyeast XL1318 London Ale III",null,"High","71 - 75",73,"18 - 23",10]
["Wyeast XL1332 Northwest Ale","Malty, mildly fruity, good depth and complexity.","High","67 - 71",69,"18 - 24",10]
["Wyeast XL1335 British Ale II",null,"High","73 - 76",74,"17 - 24",10]
["Wyeast XL1388 Belgian Strong Ale",null,"Low","74 - 78",76,"18 - 27",13]
["Wyeast XL1450 Denny's Favorite 50","Accentuates malt, caramel, or fruit character.","Low","74 - 76",75,"15 - 21",10]
["Wyeast XL1469 West Yorkshire Ale",null,"High","67 - 71",69,"18 - 22",9]
["Wyeast XL1728 Scottish Ale",null,"High","69 - 73",71,"13 - 24",12]
["Wyeast XL1762 Belgian Abbey II",null,"Medium","73 - 77",75,"18 - 24",12]
["Wyeast XL1968 London ESB Ale",null,"Very High","67 - 71",69,"18 - 22",9]
["Wyeast XL2000 Budvar Lager",null,"Medium - High","71 - 75",73,"9 - 13",9]
["Wyeast XL2001 Urquell Lager",null,"Medium - High","72 - 76",74,"9 - 13",9]
["Wyeast XL2007 Pilsen Lager",null,"Medium","71 - 75",73,"9 - 13",9]
["Wyeast XL2035 American Lager",null,"Medium","73 - 77",75,"9 - 14",9]
["Wyeast XL2042 Danish Lager",null,"Low","73 - 77",75,"8 - 13",9]
["Wyeast XL2112 California Lager",null,"High","67 - 71",69,"14 - 20",9]
["Wyeast XL2124 Bohemian Lager",null,"Low - Medium","73 - 77",75,"8 - 22",9]
["Wyeast XL2206 Bavarian Lager",null,"Medium - High","73 - 77",75,"8 - 14",9]
["Wyeast XL2278 Czech Pils",null,"Medium - High","70 - 74",72,"10 - 14",9]
["Wyeast XL2308 Munich Lager",null,"Medium","70 - 74",72,"9 - 13",9]
["Wyeast XL2565 Kölsch",null,"Low","73 - 77",75,"13 - 21",10]
["Wyeast XL2633 Octoberfest Lager Blend",null,"Low - Medium","73 - 77",75,"9 - 14",9]
["Wyeast XL3056 Bavarian Wheat Blend",null,"Medium","73 - 77",75,"18 - 23",10]
["Wyeast XL3068 Weihenstephan Weizen",null,"Low","73 - 77",75,"18 - 24",10]
["Wyeast XL3278 Belgian Lambic Blend",null,"Variable","70 - 80",75,"17 - 24",11]
["Wyeast XL3333 German Wheat",null,"High","70 - 76",73,"17 - 24",10]
["Wyeast XL3463 Forbidden Fruit",null,"Low","72 - 76",74,"17 - 24",12]
["Wyeast XL3522 Belgian Ardennes",null,"High","72 - 76",74,"18 - 24",12]
["Wyeast XL3638 Bavarian Wheat",null,"Low","70 - 76",73,"18 - 24",10]
["Wyeast XL3711 French Saison",null,"Low","77 - 83",80,"18 - 25",12]
["Wyeast XL3724 Belgian Saison",null,"Low","76 - 80",78,"21 - 35",12]
["Wyeast XL3763 Roeselare Ale Blend",null,"Variable",80,80,"18 - 30",11]
["Wyeast XL3787 Trappist High Gravity",null,"Medium","74 - 78",76,"18 - 25",12]
["Wyeast XL3942 Belgian Wheat",null,"Medium","72 - 76",74,"18 - 23",12]
["Wyeast XL3944 Belgian Witbier",null,"Medium","72 - 76",74,"16 - 24",12]
[]
[]
[null,null,"https://www.wyeastlab.com/hb_yeaststrain.cfm"]
[]
[null,null,"http://mangrovejacks.com/collections/craft-series-yeasts"]

{"sheet":"Typer","index":11,"n_rows":125,"n_cols":23,"rows_kept":125,"cut":false,"hidden":false,"merged":[[1,0,1,1],[0,5,0,20],[0,0,0,2],[1,3,1,4]]}
["Ref.: Beer Judge Certification Program",null,null,null,null,"2015 BJCP Style Guidelines"]
["Style #",null,"Style Name","Style #",null,"OG high","OG low","FG high","FG low","ABV high","ABV low","EBC high","EBC low","IBU high","IBU low","RBR","CO2 High","CO2 Low","CO2 Avg.","Yeast Type","Brief",null,"Style #"]
[]
[1,"A","American Light Lager",1,"A","1040","1028","1008","0998","4,2","2,8",6,4,"12","8",0.34,2.73,2.57,{"$f":"IF(R4=\"\",\"\",(R4+Q4)/2)","v":2.65},"Lager",null,null,1]
[1,"B","American Lager",1,"B","1050","1040","1010","1004","5,3","4,2",8,4,"18","8",0.27,2.73,2.57,{"$f":"IF(R5=\"\",\"\",(R5+Q5)/2)","v":2.65},"Lager",null,null,1]
[1,"C","Cream Ale",1,"C","1055","1042","1012","1006","5,6","4,2",10,5,"20","8",0.38,2.7,2.6,2.6500000000000004,"Ale",null,null,1]
[1,"D","American Wheat Beer",1,"D","1055","1040","1013","1008","5,5","4,0",12,6,"30","15",0.48,2.6,2.2999999999999998,2.4500000000000002,"Ale",null,null,1]
[2,"A","International Pale Lager",2,"A","1050","1042","1012","1008","6,0","4,6",12,4,"25","18",0.74,2.5,2.2999999999999998,2.4,"Lager",null,null,2]
[2,"B","International Amber Lager",2,"B","1055","1042","1014","1008","6,0","4,6",8,14,"25","8",0.74,2.5,2.2999999999999998,2.4,"Lager",null,null,2]
[2,"C","International Dark Lager",2,"C","1056","1044","1012","1008","6,0","4,2",43,28,"20","8",0.74,2.5,2.2999999999999998,2.4,"Lager",null,null,2]
[3,"A","Czech Pale Lager",3,"A","1044","1028","1014","1008","4,1","3,0",12,6,"35","20",0.74,2.5,2.2999999999999998,2.4,"Lager",null,null,3]
[3,"B","Czech Premium Pale Lager",3,"B","1060","1044","1017","1013","5,8","4,2",12,7,"45","30",0.74,2.5,2.2999999999999998,2.4,"Lager",null,null,3]
[3,"C","Czech Amber Lager",3,"C","1060","1044","1017","1013","5,8","4,4",32,20,"35","20",0.74,2.5,2.2999999999999998,2.4,"Lager",null,null,3]
[3,"D","Czech Dark Lager",3,"D","1060","1044","1017","1013","5,8","4,4",69,28,"34","18",0.74,2.5,2.2999999999999998,2.4,"Lager",null,null,3]
[4,"A","Munich Helles",4,"A","1048","1044","1012","1006","5,4","4,7",10,6,"22","16",0.4,2.68,2.2599999999999998,2.4699999999999998,"Lager",null,null,4]
[4,"B","Festbier",4,"B","1057","1054","1012","1010","6,3","5,8",14,8,"25","18",0.43,2.73,2.57,2.65,"Lager",null,null,4]
[4,"C","Helles Bock",4,"C","1072","1064","1018","1011","7,4","6,3",2,12,"35","23",0.43,2.73,2.16,2.4450000000000003,"Lager",null,null,4]
[5,"A","German Leichtbier",5,"A","1034","1026","1010","1006","3,6","2,4",10,4,"28","15",0.34,2.7,2.2000000000000002,2.4500000000000002,"Lager",null,null,5]
[5,"B","Kölsch",5,"B","1050","1044","1011","1007","5,2","4,4",10,7,"30","18",0.55000000000000004,2.73,2.42,2.5750000000000002,"Kölsch",null,null,5]
[5,"C","German Helles Exportbier",5,"C","1056","1048","1015","1010","6,0","4,8",14,8,"30","20",0.5,2.57,2.57,2.57,"Lager",null,null,5]
[5,"D","German Pils",5,"D","1050","1044","1013","1008","5,2","4,4",10,4,"40","22",0.75,2.52,2.52,2.52,"Lager",null,null,5]
[6,"A","Märzen",6,"A","1060","1054","1014","1010","6,3","5,8",14,16,"24","18",0.43,2.73,2.57,2.65,"Lager",null,null,6]
[6,"B","Rauchbier",6,"B","1057","1050","1016","1012","8–6","4,8",43,24,"30","20",0.45,2.57,2.16,2.3650000000000002,"Ale",null,null,6]
[6,"C","Dunkles Bock",6,"C","1072","1064","1019","1013","7,2","6,3",43,28,"27","20",0.34,2.7,2.2000000000000002,2.4500000000000002,"Lager",null,null,6]
[7,"A","Vienna Lager",7,"A","1055","1048","1014","1010","5,5","4,7",10,18,"30","18",0.48,2.6,2.4,2.5,"Lager",null,null,7]
[7,"B","Altbier",7,"B","1052","1044","1014","1008","5,5","4,3",33,22,"50","25",0.83,3.09,2.16,2.625,"Ale",null,null,7]
[7,"C","Kellerbier",7,"C","1051","1045","1012","1008","5,4","4,7",14,6,"35","20",0.63,3.09,2.16,2.625,"Ale",null,null,7]
[7,"D","Amber Kellerbier",7,"D","1054","1048","1016","1012","5,4","4,8",14,14,"40","25",0.63,3.09,2.16,2.625,"Ale",null,null,7]
[8,"A","Munich Dunkel",8,"A","1056","1048","1016","1010","5,6","4,5",55,28,"28","18",0.43,2.66,2.21,2.4350000000000001,"Lager",null,null,8]
[8,"B","Schwarzbier",8,"B","1052","1046","1016","1010","5,4","4,4",59,33,"30","20",0.53,2.6,2.2000000000000002,2.4000000000000004,"Lager",null,null,8]
[9,"A","Doppelbock",9,"A","1112","1072","1024","1016","0,0","7,0",10,12,"26","16",0.23,2.62,2.2599999999999998,2.44,"Lager",null,null,9]
[9,"B","Eisbock",9,"B","1120","1078","1035","1020","4,0","9,0",59,35,"35","25",0.28000000000000003,2.37,2.37,2.37,"Lager",null,null,9]
[9,"C","Baltic Porter",9,"C","1090","1060","1024","1016","9,5","6,5",59,33,"40","20",0.38,2.5,1.8,2.15,"Ale",null,null,9]
[10,"A","Weizen",10,"A","1052","1044","1014","1010","5,6","4,3",12,4,"15","8",0.23,4.4800000000000004,3.6,4.04,"Wheat Ale",null,null,10]
[10,"B","Dunkelweizen",10,"B","1056","1044","1014","1010","5,6","4,3",45,28,"18","10",0.28000000000000003,4.4800000000000004,3.6,4.04,"Wheat Ale",null,null,10]
[10,"C","Weizenbock",10,"C","1090","1064","1022","1015","9,0","6,5",10,12,"30","15",0.28999999999999998,4.74,3.71,4.2249999999999996,"Wheat Ale",null,null,10]
[11,"A","Standard Bitter",11,"A","1039","1030","1011","1007","3,8","3,2",8,16,"35","25",0.81,1.3,0.75,1.0249999999999999,"Ale",null,null,11]
[11,"B","Best Bitter",11,"B","1048","1040","1012","1008","4,6","3,8",12,16,"40","25",0.74,1.3,0.75,1.0249999999999999,"Ale",null,null,11]
[11,"C","Strong Bitter",11,"C","1060","1048","1016","1010","6,2","4,6",16,16,"50","30",0.73,1.3,0.75,1.0249999999999999,"Ale",null,null,11]
[12,"A","British Golden Ale",12,"A","1053","1038","1012","1006","5,0","3,8",12,4,"45","20",0.47,2.6,2.2999999999999998,{"$f":"IF(R40=\"\",\"\",(R40+Q40)/2)","v":2.4500000000000002},"Ale",null,null,12]
[12,"B","Australian Sparkling Ale",12,"B","1050","1038","1006","1004","6,0","4,5",14,8,"35","20",0.8,4.5,3,3.75,"Ale",null,null,12]
[12,"C","English IPA",12,"C","1075","1050","1018","1010","7,5","5,0",8,12,"60","40",0.8,2.2999999999999998,1.5,1.9,"Ale",null,null,12]
[13,"A","Dark Mild",13,"A","1038","1030","1013","1008","3,8","3,0",49,24,"25","10",0.47,2,1.3,1.65,"Ale",null,null,13]
[13,"B","British Brown Ale",13,"B","1052","1040","1013","1008","5,4","4,2",43,24,"30","20",0.54,2.2999999999999998,1.5,1.9,"Ale",null,null,13]
[13,"C","English Porter",13,"C","1052","1040","1014","1008","5,4","4,0",59,39,"35","18",0.56999999999999995,2.5,1.7,2.1,"Ale",null,null,13]
[14,"A","Scottish Light",14,"A","1035","1030","1013","1010","3,2","2,5",43,33,"20","10",0.4,1.3,0.75,1.0249999999999999,"Ale",null,null,14]
[14,"B","Scottish Heavy",14,"B","1040","1035","1015","1010","3,9","3,2",43,26,"20","10",0.42,1.3,0.75,1.0249999999999999,"Ale",null,null,14]
[14,"C","Scottish Export",14,"C","1060","1040","1016","1010","6,0","3,9",43,26,"30","15",0.45,1.3,0.75,1.0249999999999999,"Ale",null,null,14]
[15,"A","Irish Red Ale",15,"A",1060,1044,"1014","1010",6,4,18,35,"28","18",0.43,2.2999999999999998,1.5,1.9,"Ale",null,null,15]
[15,"B","Irish Stout",15,"B","1044","1036","1011","1007","4,5","4,0",79,49,"45","25",0.43,2.2999999999999998,1.5,1.9,"Ale",null,null,15]
[15,"C","Irish Extra Stout",15,"C","1062","1052","1014","1010","6,5","5,5",79,49,"50","35",0.89,2,1.6,1.8,"Ale",null,null,15]
[16,"A","Sweet Stout",16,"A","1060","1044","1024","1012","6,0","4,0",79,59,"40","20",0.51,2.4,2,2.2000000000000002,"Ale",null,null,16]
[16,"B","Oatmeal Stout",16,"B","1065","1045","1018","1010","5,9","4,2",79,43,"40","25",0.56000000000000005,2.4,2,2.2000000000000002,"Ale",null,null,16]
[16,"C","Tropical Stout",16,"C","1075","1056","1018","1010","8,0","5,5",79,59,"50","30",0.77,2.6,2.2999999999999998,2.4500000000000002,"Ale",null,null,16]
[16,"D","Foreign Extra Stout",16,"D","1075","1056","1018","1010","8,0","6,3",79,59,"70","50",0.77,2.6,2.2999999999999998,2.4500000000000002,"Ale",null,null,16]
[17,"A","British Strong Ale",17,"A","1080","1055","1022","1015","8,0","5,5",4,16,"60","30",0.22,2.2999999999999998,1.5,1.9,"Ale",null,null,17]
[17,"B","Old Ale",17,"B","1088","1055","1022","1015","9,0","5,5",43,20,"60","30",0.57999999999999996,2.2999999999999998,1.5,1.9,"Ale",null,null,17]
[17,"C","Wee Heavy",17,"C","1130","1070","1040","1018","0,0","6,5",49,28,"35","17",0.22,2.2999999999999998,1.5,1.9,"Ale",null,null,17]
[17,"D","English Barleywine",17,"D","1120","1080","1030","1018","2,0","8,0",4,16,"70","35",0.51,2.2999999999999998,1.3,1.7999999999999998,"Ale",null,null,17]
[18,"A","Blonde Ale",18,"A","1054","1038","1013","1008","5,5","3,8",12,6,"28","15",0.47,2.6,2.2999999999999998,2.4500000000000002,"Ale",null,null,18]
[18,"B","American Pale Ale",18,"B","1060","1045","1015","1010","6,2","4,5",0,10,"50","30",0.71,2.78,2.2599999999999998,2.5199999999999996,"Ale",null,null,18]
[19,"A","American Amber Ale",19,"A","1060","1045","1015","1010","6,2","4,5",33,20,"40","25",0.61,2.78,2.2599999999999998,2.5199999999999996,"Ale",null,null,19]
[19,"B","California Common",19,"B","1054","1048","1014","1011","5,5","4,5",28,20,"45","30",0.72,2.8,2.4,2.5999999999999996,"Lager",null,null,19]
[19,"C","American Brown Ale",19,"C","1060","1045","1016","1010","6,2","4,3",69,35,"30","20",0.56000000000000005,2.5,1.5,2,"Ale",null,null,19]
[20,"A","Robust Porter",20,"A","1070","1050","1018","1012","6,5","4,8",79,43,"50","25",0.65,2.5,1.8,2.15,"Ale",null,null,20]
[20,"B","American Stout",20,"B","1075","1050","1022","1010","7,0","5,0",79,59,"75","35",0.85,2.6,2.2999999999999998,2.4500000000000002,"Ale",null,null,20]
[20,"C","Imperial Stout",20,"C","1115","1075","1030","1018","2,0","8,0",79,59,"90","50",0.71,2.2999999999999998,1.5,1.9,"Ale",null,null,20]
[21,"A","American IPA",21,"A","1070","1056","1014","1008","7,5","5,5",8,12,"70","40",0.85,2.2999999999999998,1.5,1.9,"Ale",null,null,21]
[21,"B","Belgian IPA",21,"B","1080","1058","1016","1008","9,5","6,2",10,10,"100","50",0.8,2.2999999999999998,1.5,{"$f":"IF(R69=\"\",\"\",(R69+Q69)/2)","v":1.9},"Ale",null,null,21]
[21,"C","Black IPA",21,"C","1085","1050","1018","1010","9,0","5,5",79,49,"90","50",0.8,2.2999999999999998,1.5,1.9,"Ale",null,null,21]
[21,"D","Brown IPA",21,"D","1070","1056","1016","1008","7,5","5,5",37,22,"70","40",0.8,2.2999999999999998,1.5,1.9,"Ale",null,null,21]
[21,"E","Red IPA",21,"E","1070","1056","1016","1008","7,5","5,5",37,22,"70","40",0.8,2.2999999999999998,1.5,1.9,"Ale",null,null,21]
[21,"F","Rye IPA",21,"F","1075","1056","1014","1008","8,0","5,5",8,12,"75","50",0.8,2.2999999999999998,1.5,1.9,"Ale",null,null,21]
[21,"G","White IPA",21,"G","1065","1056","1016","1010","7,0","5,5",16,10,"70","40",0.8,2.2999999999999998,1.5,1.9,"Ale",null,null,21]
[22,"A","Double IPA",22,"A","1085","1065","1018","1008","0,0","7,5",8,12,"120","60",0.8,2.2999999999999998,1.5,1.9,"Ale",null,null,22]
[22,"B","American Strong Ale",22,"B","1090","1062","1024","1014","0,0","6,3",18,14,"100","50",0.84,2.2999999999999998,1.3,{"$f":"IF(R76=\"\",\"\",(R76+Q76)/2)","v":1.7999999999999998},"Ale",null,null,22]
[22,"C","American Barleywine",22,"C","1120","1080","1030","1016","2,0","8,0",37,20,"100","50",0.84,2.2999999999999998,1.3,1.7999999999999998,"Ale",null,null,22]
[22,"D","Wheatwine",22,"D","1120","1080","1030","1016","2,0","8,0",10,16,"60","30",0.84,2.5,2,2.25,"Ale",null,null,22]
[23,"A","Berliner Weisse",23,"A","1032","1028","1006","1003","3,8","2,8",6,4,"8","3",0.2,3.45,3.45,3.45,"Ale w. Lactic",null,null,23]
[23,"B","Flanders Red Ale",23,"B","1057","1048","1012","1002","6,5","4,6",32,20,"25","10",0.37,2.5,1.9,2.2000000000000002,"Ale w. Lactic",null,null,23]
[23,"C","Oud Bruin",23,"C","1074","1040","1012","1008","8,0","4,0",43,30,"25","20",0.41,2.5,1.9,2.2000000000000002,"Ale w. Lactic",null,null,23]
[23,"D","Lambic",23,"D","1054","1040","1010","1001","6,5","5,0",14,6,"10","0",0.12,4.5,3,3.75,"Ale w. Lactic",null,null,23]
[23,"E","Gueuze",23,"E","1060","1040","1006","1000","8,0","5,0",14,6,"10","0",0.12,4.5,3,3.75,"Ale w. Lactic",null,null,23]
[23,"F","Fruit Lambic",23,"F","1060","1040","1010","1000","7,0","5,0",14,6,"10","0",0.11,4.5,2.6,3.55,"Ale w. Lactic",null,null,23]
[24,"A","Witbier",24,"A","1052","1044","1012","1008","5,5","4,5",8,4,"20","8",0.32,2.6,2.1,2.35,"Ale",null,null,24]
[24,"B","Belgian Pale Ale",24,"B","1054","1048","1014","1010","5,5","4,8",8,16,"30","20",0.49,2.5,1.9,2.2000000000000002,"Ale",null,null,24]
[24,"C","Bière de Garde",24,"C","1080","1060","1016","1008","8,5","6,0",18,12,"28","18",0.35,2.5,1.9,2.2000000000000002,"Ale",null,null,24]
[25,"A","Belgian Blond Ale",25,"A","1075","1062","1018","1008","7,5","6,0",14,8,"30","15",0.34,2.4,1.9,2.15,"Ale",null,null,25]
[25,"B","Saison (pale) (standard)",25,"B","1065","1048","1008","1002","7,0","5,0",8,10,"35","20",0.54,2.4,1.9,2.15,"Ale",null,null,25]
[25,"C","Saison (dark) (standard)",25,"C","1065","1048","1008","1002","7,0","5,0",43,30,"35","20",0.54,2.4,1.9,2.15,"Ale",null,null,25]
[25,"D","Saison (pale) (table)",25,"D","1065","1048","1008","1002","5,0","3,5",8,10,"35","20",0.54,2.4,1.9,2.15,"Ale",null,null,25]
[25,"E","Saison (pale) (super)",25,"E","1065","1048","1008","1002","9,5","7,0",8,10,"35","20",0.54,2.4,1.9,2.15,"Ale",null,null,25]
[25,"F","Belgian Golden Strong Ale",25,"F","1095","1070","1016","1005","0,5","7,5",12,6,"35","22",0.38,2.4,1.9,2.15,"Ale",null,null,25]
[26,"A","Trappist Single",26,"A","1054","1044","1010","1004","6,0","4,8",10,6,"45","25",0.49,2.5,1.9,2.2000000000000002,"Ale",null,null,26]
[26,"B","Belgian Dubbel",26,"B","1075","1062","1018","1008","7,6","6,0",33,20,"25","15",0.3,2.4,1.9,2.15,"Ale",null,null,26]
[26,"C","Belgian Tripel",26,"C","1085","1075","1014","1008","9,5","7,5",14,9,"40","20",0.41,2.4,1.9,2.15,"Ale",null,null,26]
[26,"D","Belgian Dark Strong Ale",26,"D","1110","1075","1024","1010","2,0","8,0",43,24,"35","20",0.31,2.5,1.9,2.2000000000000002,"Ale",null,null,26]
[27,"A","Historical Beer: Gose",27,"A","1056","1036","1010","1006","4,8","4,2",8,6,"12","5","",2.5,1.9,2.2000000000000002,"Ale",null,null,27]
[27,"B","Historical Beer: Kentucky Common",27,"B","1055","1044","1018","1010","5,5","4,0",39,22,"30","15",0.48,2.5,1.9,2.2000000000000002,"Ale",null,null,27]
[27,"C","Historical Beer: Lichtenhainer",27,"C","1040","1032","1008","1004","4,7","3,5",12,6,"12","5","-",2.5,1.9,2.2000000000000002,"Ale",null,null,27]
[27,"D","Historical Beer: London Brown Ale",27,"D","1038","1033","1015","1012","3,6","2,8",69,43,"20","15","-",2.5,1.9,2.2000000000000002,"Ale",null,null,27]
[27,"E","Historical Beer: Piwo Grodziskie",27,"E","1032","1028","1012","1006","3,3","2,5",12,6,"35","20","-",5,4,4.5,"Ale",null,null,27]
[27,"F","Historical Beer: Pre-Prohibition Lager",27,"F","1060","1044","1015","1010","6,0","4,5",12,6,"40","25","-",2.5,1.9,2.2000000000000002,"Lager",null,null,27]
[27,"G","Historical Beer: Pre-Prohibition Porter",27,"G","1060","1046","1016","1010","6,0","4,5",59,35,"30","20","-",2.5,1.9,2.2000000000000002,"Ale",null,null,27]
[27,"H","Historical Beer: Roggenbier",27,"H","1056","1046","1014","1010","6,0","4,5",37,28,"20","10","-",2.5,1.9,2.2000000000000002,"Ale",null,null,27]
[27,"I","Historical Beer: Sahti",27,"I","1120","1076","1020","1016","1,0","7,0",4,8,"15","7","-",2.5,1.9,2.2000000000000002,"Ale",null,null,27]
[28,"A","Brett Beer",28,"A","-","-","-","-","-","-","-","-","-","-","-","-","-","-","-",null,null,28]
[28,"B","Mixed-Fermentation Sour Beer",28,"B","-","-","-","-","-","-","-","-","-","-","-","-","-","-","-",null,null,28]
[28,"C","Wild Specialty Beer",28,"C","-","-","-","-","-","-","-","-","-","-","-","-","-","-","-",null,null,28]
[29,"A","Fruit Beer",29,"A","-","-","-","-","-","-","-","-","-","-","-",3,2,2.5,"Ale",null,null,29]
[29,"B","Fruit and Spice Beer",29,"B","-","-","-","-","-","-","-","-","-","-","-","-","-","-","-",null,null,29]
[29,"C","Specialty Fruit Beer",29,"C","-","-","-","-","-","-","-","-","-","-","-","-","-","-","-",null,null,29]
[30,"A","Spice, Herb, or Vegetable Beer",30,"A","-","-","-","-","-","-","-","-","-","-","-","-","-","-","-",null,null,30]
[30,"B","Autumn Seasonal Beer",30,"B","-","-","-","-","-","-","-","-","-","-","-","-","-","-","-",null,null,30]
[30,"C","Christmas Beer",30,"C","-","-","-","-","-","-","-","-","-","-","-",2.2999999999999998,1.9,{"$f":"(R115+Q115)/2","v":2.0999999999999996},"Ale or Lager",null,null,30]
[30,"C","Winter Seasonal Beer",30,"C","-","-","-","-","-","-","-","-","-","-","-",2.2999999999999998,1.9,{"$f":"(R116+Q116)/2","v":2.0999999999999996},"Ale or Lager"]
[31,"A","Alternative Grain Beer",31,"A","-","-","-","-","-","-","-","-","-","-","-","-","-","-","-",null,null,31]
[31,"B","Alternative Sugar Beer",31,"B","-","-","-","-","-","-","-","-","-","-","-","-","-","-","-",null,null,31]
[32,"A","Classic Style Smoked Beer",32,"A","-","-","-","-","-","-","-","-","-","-","-","-","-","-","-",null,null,32]
[32,"B","Specialty Smoked Beer",32,"B","-","-","-","-","-","-","-","-","-","-","-","-","-","-","-",null,null,32]
[33,"A","Wood-Aged Beer",33,"A","-","-","-","-","-","-","-","-","-","-","-",2.57,2.16,2.3650000000000002,"Ale",null,null,33]
[33,"B","Specialty Wood-Aged Beer",33,"B","-","-","-","-","-","-","-","-","-","-","-","-","-","-","-",null,null,33]
[34,"A","Clone Beer",34,"A","-","-","-","-","-","-","-","-","-","-","-","-","-","-","-",null,null,34]
[34,"B","Mixed-Style Beer",34,"B","-","-","-","-","-","-","-","-","-","-","-","-","-","-","-",null,null,34]
[34,"C","Experimental Beer",34,"C","-","-","-","-","-","-","-","-","-","-","-","-","-","-","-",null,null,34]

{"sheet":"Indkøb","index":12,"n_rows":2,"n_cols":2,"rows_kept":2,"cut":false,"hidden":false,"merged":[[1,1,1,5]]}
[]
[null,"Her kan man f.eks. kopiere kvittering for indkøb ind."]

{"sheet":"Links","index":13,"n_rows":31,"n_cols":2,"rows_kept":31,"cut":false,"hidden":false,"merged":[]}
[]
["Shopping:","http://brygladen.com/"]
[null,"http://www.hjemmebryggeren.dk/"]
[null,"http://www.albryg.dk/"]
[null,"http://www.bryglageret.dk/"]
[null,"https://brygforretningen.dk/"]
[]
["Opskrifter:","http://www.candisyrup.com/recipes.html"]
[null,"http://www.castlemalting.com/CastleMaltingBeerRecipes.asp?P=94&Language=Danish"]
[]
["Ressource Guides:","https://byo.com/resources"]
[]
["Hops","http://beerlegends.com/hops"]
[null,"https://ychhops.com/varieties"]
[null,"http://www.castlemalting.com/CastleMaltingHops.asp?P=105&Language=Danish"]
[null,"http://hjemmebryg.things-4-you.dk/?p=500"]
[]
["Malt","http://www.castlemalting.com/CastleMaltingMalts.asp?P=105&Language=Danish"]
[]
["Malt Descriptions","http://www.beercolor.com/malt_descriptions.htm"]
[]
["Yeast","https://www.wyeastlab.com/hb_yeaststrain.cfm"]
[null,"http://mangrovejacks.com/collections/craft-series-yeasts"]
[null,"https://www.whitelabs.com/beer/homebrew/listings"]
[null,"http://www.fermentis.com/brewing/homebrewing/product-range/"]
[]
["BU:GU / RBR","http://www.madalchemist.com/chart_bitterness_corrected.html"]
[]
["Glenn Tinseth's Website","http://www.realbeer.com/hops/"]
[]
["Beer Judge Certification Program","http://bjcp.org/"]