{"text_format":"1","workbook":"xlsx","n_sheets":14,"sheets":["BrewReport","INFO","Labels","Data","Omregninger","Malt","Malt X-ref.","Humle","Humle X-ref.","Tilsætninger","Gær","Typer","Indkøb","Links"],"not_rendered":{"charts":1,"images":6,"macros":1,"external_links":0,"defined_names":3,"comments":5,"pivot_tables":0},"unopened":[],"bounds":{"document_bytes":16777216,"sheet_cells":100000,"rows_first":2000,"rows_last":500,"rows_between":2000,"halvings":0,"cell_chars":16384,"cell_head_chars":4096},"cells_cut":0,"cells_raw":0,"read":"whole","date_system":"1900"}

{"sheet":"BrewReport","index":0,"n_rows":81,"n_cols":13,"rows_kept":81,"cut":false,"hidden":false,"merged":[[75,4,75,6],[2,0,2,2],[80,1,80,6],[9,0,9,1],[10,0,10,1],[11,0,11,1],[12,0,12,1],[13,0,13,1],[14,0,14,1],[15,0,15,1],[16,0,16,1],[17,0,17,1],[74,2,74,3],[74,4,74,6],[79,4,79,6],[78,4,78,6],[42,0,42,5],[77,4,77,6],[76,4,76,6],[79,1,79,3],[78,1,78,3],[77,1,77,3],[76,1,76,3],[75,1,75,3],[31,9,31,10],[1,0,1,2],[53,0,53,2],[52,0,52,2],[51,0,51,2],[50,0,50,2],[49,0,49,2],[48,0,48,2],[47,0,47,2],[46,0,46,2],[45,0,45,2],[44,0,44,2],[39,0,39,2],[38,0,38,2],[37,0,37,2],[36,0,36,2],[35,0,35,2],[6,0,6,3],[2,3,2,4],[8,0,8,1],[40,0,40,2],[5,0,5,2],[3,0,3,2],[38,7,38,8],[69,11,69,12],[70,11,71,12],[48,8,48,12],[50,9,50,12],[2,6,2,7],[26,7,26,8],[27,9,27,10],[29,7,29,8],[30,7,30,8],[31,7,31,8],[5,6,5,7],[7,9,7,10],[33,9,33,10],[12,7,12,8],[11,7,11,8],[10,7,10,8],[8,7,8,8],[6,7,6,12],[16,7,16,8],[2,10,2,12],[15,7,15,8],[23,9,23,10],[22,9,22,10],[32,9,32,10],[32,7,32,8],[33,7,33,8],[43,7,43,10],[37,7,37,8],[79,10,79,12],[80,7,80,9],[80,10,80,12],[78,7,78,9],[78,10,78,12],[76,7,76,9],[76,10,76,12],[77,7,77,9],[77,10,77,12],[79,7,79,9],[75,7,75,9],[75,10,75,12],[66,9,66,12],[63,7,63,8],[71,9,71,10],[71,7,71,8],[44,11,44,12],[44,9,44,10],[45,9,45,10],[68,11,68,12],[68,9,68,10],[57,8,57,12],[54,9,54,10],[52,9,52,10],[0,0,0,2],[0,3,0,12],[50,3,50,4],[20,9,20,10],[21,9,21,10],[47,3,47,4],[18,0,18,2],[38,9,38,10],[35,7,35,8],[35,9,35,10],[42,7,42,12],[34,9,34,10],[1,3,1,12],[7,7,7,8],[18,7,18,8],[9,7,9,8],[37,9,37,10],[25,9,25,10],[26,9,26,10],[66,7,66,8],[55,0,55,5],[40,7,40,8],[62,9,62,10],[51,9,51,10],[61,9,61,10],[54,7,54,8],[53,7,53,8],[65,7,65,12],[60,11,60,12],[54,11,54,12],[47,7,47,12],[27,7,27,8],[28,7,28,8],[28,9,28,10],[3,9,3,10],[34,7,34,8],[36,9,36,10],[56,2,56,5],[74,7,74,9],[74,10,74,12],[39,9,39,10],[70,9,70,10],[44,7,44,8],[45,7,45,8],[72,7,72,8],[72,9,72,10],[72,11,72,12],[67,11,67,12],[45,11,45,12],[51,11,51,12],[56,7,56,12],[39,7,39,8],[69,9,69,10],[60,9,60,10],[49,7,50,8],[3,6,3,7],[21,7,21,8],[22,7,22,8],[23,7,23,8],[24,7,24,8],[14,7,14,8],[13,7,13,8],[24,9,24,10],[25,7,25,8],[5,9,5,10],[67,0,72,5],[58,7,59,8],[58,9,58,12],[59,9,59,12],[40,9,40,10],[61,11,62,12],[62,7,62,8],[30,9,30,10],[29,9,29,10],[49,9,49,12],[61,7,61,8],[63,9,63,10],[63,11,63,12],[52,11,53,12],[67,9,67,10],[66,1,66,2],[66,3,66,5],[53,9,53,10],[52,7,52,8],[36,7,36,8],[70,7,70,8],[69,7,69,8],[68,7,68,8],[67,7,67,8]]}
["Bryggeri:",null,null,"Hulebækkens bryghus"]
["Bryg navn:",null,null,"Forårsvelsignelse"]
["Bryg nr.:",null,null,29,null,"Type:","Weizenbock",null,{"$f":"IF($G$3=\"\",\"\",CONCATENATE(VLOOKUP($G$3,Typer!$C$4:$P$125,2,FALSE),VLOOKUP($G$3,Typer!$C$4:$P$125,3,FALSE)))","v":"10C"},"Dato:","2017-04-17"]
["Typiske data:",null,null,"EBC",{"$f":"IF($G$3=\"\",\"\",CONCATENATE(VLOOKUP($G$3,Typer!$C$4:$P$125,10,FALSE),\" - \",VLOOKUP($G$3,Typer!$C$4:$P$125,11,FALSE)))","v":"10 - 12"},"OG",{"$f":"IF($G$3=\"\",\"\",CONCATENATE(VLOOKUP($G$3,Typer!$C$3:$T$125,4,FALSE),\" - \",VLOOKUP($G$3,Typer!$C$3:$T$125,5,FALSE)))","v":"1090 - 1064"},null,"IBU",{"$f":"IFERROR(IF($G$3=\"\",\"\",CONCATENATE(VLOOKUP($G$3,Typer!$C$4:$P$125,12,FALSE),\" - \",VLOOKUP($G$3,Typer!$C$4:$P$125,13,FALSE))),\"\")","v":"30 - 15"},null,"RBR",{"$f":"IFERROR(IF($G$3=\"\",\"\",VLOOKUP($G$3,Typer!$C$4:$P$125,14,FALSE)),\"\")","v":0.28999999999999998}]
[]
["Dette brygs data:",null,null,null,{"$f":"IF(Data!G26=0,\"\",Data!G26)","v":9.9},"OG",{"$f":"IF(D19=0,\"\",IF(D50=\"\",IF(K3=\"\",Data!I26,D49),IF(K3=\"\",Data!I26,D50)))","v":1085},null,"IBU",{"$f":"IF(Data!I55=0,\"\",Data!I55)","v":12.367999999999999},null,"RBR",{"$f":"IF(AND(J50=\"\",J51=\"\"),\"\",IF(D52=\"\",IF(J6=\"\",\"\",(Data!I55/(G6-1000)*(1+((MAX(Data!G29:G30)/100)-0.7655)))),(Data!I55/(G6-1000)*(1+((D53/100)-0.7655)))))","v":3.4121129411764706E-2}]
["Ingredienser",null,null,null,"fra:","Hjemmebryggeren",null,"Mæskning"]
["Malttype",null,"EBC","Vægt","Enhed","Priser",null,"Proces",null,"Tid",null,"Temp.","Starttider (tt:mm)"]
{"$rows_left_out":74}
{"sheet":"INFO","index":1,"n_rows":24,"n_cols":10,"rows_kept":24,"cut":false,"hidden":false,"merged":[[17,2,19,2],[8,2,9,2],[23,0,23,5],[1,1,1,4],[3,2,6,2],[11,2,15,2],[1,6,1,9],[16,9,17,9],[16,7,17,7],[16,6,17,6],[19,7,20,7],[19,6,20,6],[19,9,20,9]]}
[]
[null,"Brew like a Monk - essentials",null,null,null,null,"Temperature steps in Beer Brewing"]
[null,null,null,null,null,null,"Temperature","Name","Function","Good for"]
[null,null,"Malts and Sugars","Limit malts darker than 100 EBC to 7%"]
[null,null,null,"Use sugar for 10 - 20% of grist",null,null,"35°C","Acid Rest","For undermodified malts;","Bohemian Pilsners"]
[null,null,null,"Sucrose adds alcohol and lightens the beer"]
[null,null,null,"Caramelized sugars add rumminess and complexity",null,null,"45°C","Acid Rest","For better flow during mashing","All beers"]
[]
{"$rows_left_out":17}
{"sheet":"Labels","index":2,"n_rows":92,"n_cols":22,"rows_kept":92,"cut":false,"hidden":false,"merged":[[91,15,91,21],[91,3,91,9],[68,15,68,21],[68,3,68,9],[45,15,45,21],[45,3,45,9],[22,15,22,21],[22,3,22,9],[79,22,89,23],[51,22,55,23],[54,16,54,17],[56,22,66,23],[71,1,73,11],[74,10,78,11],[77,4,77,5],[85,16,85,20],[51,3,52,9],[51,15,52,21],[56,4,56,8],[56,16,56,20],[56,10,66,11],[57,4,57,5],[57,16,57,17],[74,22,78,23],[71,13,73,23],[88,15,88,21],[74,3,75,9],[65,15,65,21],[62,4,62,8],[62,16,62,20],[74,15,75,21],[77,16,77,17],[85,4,85,8],[79,4,79,8],[79,16,79,20],[80,4,80,5],[80,16,80,17],[81,4,81,8],[81,16,81,20],[79,10,89,11],[88,3,88,9],[89,16,89,17],[89,4,89,5],[82,16,84,20],[82,4,84,8],[66,6,66,9],[66,18,66,21],[89,6,89,9],[89,18,89,21],[28,10,32,11],[25,1,27,11],[51,10,55,11],[42,3,42,9],[42,15,42,21],[65,3,65,9],[54,4,54,5],[47,4,47,9],[47,15,47,18],[48,1,50,11],[48,13,50,23],[34,4,34,5],[33,4,33,8],[33,16,33,20],[39,4,39,8],[39,16,39,20],[35,4,35,8],[58,4,58,8],[58,16,58,20],[43,16,43,17],[43,18,43,21],[66,4,66,5],[66,16,66,17],[10,10,20,11],[10,16,10,20],[16,16,16,20],[11,4,11,5],[11,16,11,17],[12,16,12,20],[12,4,12,8],[19,15,19,21],[20,4,20,5],[20,6,20,9],[0,1,0,23],[1,3,1,9],[5,3,6,9],[5,10,9,11],[5,15,6,21],[5,22,9,23],[8,4,8,5],[8,16,8,17],[2,13,4,23],[2,1,4,11],[33,22,43,23],[35,16,35,20],[59,16,61,20],[59,4,61,8],[13,16,15,20],[36,16,38,20],[36,4,38,8],[20,18,20,21],[20,16,20,17],[13,4,15,8],[33,10,43,11],[34,16,34,17],[19,3,19,9],[16,4,16,8],[28,3,29,9],[28,15,29,21],[25,13,27,23],[28,22,32,23],[31,16,31,17],[31,4,31,5],[43,4,43,5],[43,6,43,9],[10,22,20,23],[10,4,10,8]]}
[null,"FLASKE-ETIKETTER"]
[null,null,null,"Udfyldes automatisk fra BrewReport til denne Label "]
[]
[]
[]
[null,null,null,{"$f":"IF(BrewReport!D2<>\"\",CONCATENATE(BrewReport!D2,\" - \",BrewReport!G3),IF(BrewReport!G3=\"\",\"\",BrewReport!G3))","v":"Forårsvelsignelse - Weizenbock"},null,null,null,null,null,null,null,null,null,null,null,{"$f":"$D$6","v":"Forårsvelsignelse - Weizenbock"}]
[]
[]
{"$rows_left_out":85}
{"sheet":"Data","index":3,"n_rows":333,"n_cols":16,"rows_kept":333,"cut":false,"hidden":false,"merged":[[56,4,56,8],[29,3,29,4],[31,10,32,10],[30,10,30,13],[23,11,23,13],[31,13,32,13],[31,12,32,12],[31,11,32,11],[28,11,28,13],[27,11,27,13],[26,11,26,13],[25,11,25,13],[24,11,24,13],[31,3,31,4],[28,7,31,7],[15,11,15,13],[20,11,20,13],[19,11,19,13],[18,11,18,13],[17,11,17,13],[16,11,16,13],[21,11,21,13],[22,11,22,13],[16,3,21,3],[28,8,31,8],[73,8,73,9],[0,3,0,8],[34,7,34,8],[33,7,33,8],[54,5,54,7],[1,4,1,8],[2,4,2,8],[5,5,5,8],[4,5,4,8],[3,5,3,8],[28,3,28,4],[27,6,27,7],[18,4,18,6],[6,5,6,8],[30,3,30,4]]}
[{"$f":"IF(BrewReport!J10>0,BrewReport!J10,\"\")","v":10},{"$f":"IF(BrewReport!L10>0,BrewReport!L10,\"\")","v":45},null,"STAMDATA"]
[{"$f":"IF(BrewReport!J12>0,BrewReport!J12,\"\")","v":10},{"$f":"IF(BrewReport!L12>0,BrewReport!L12,\"\")","v":57},null,"Bryggeri"]
[{"$f":"IF(BrewReport!J13>0,BrewReport!J13,\"\")","v":30},{"$f":"IF(BrewReport!L13>0,BrewReport!L13,\"\")","v":62},null,"Brygmester"]
[{"$f":"IF(BrewReport!J14>0,BrewReport!J14,\"\")","v":""},{"$f":"IF(BrewReport!L14>0,BrewReport!L14,\"\")","v":""},null,"Mæskeeffektivitet",0.75,"Anvendes til at estimere Original Gravity"]
[{"$f":"IF(BrewReport!J15>0,BrewReport!J15,\"\")","v":""},{"$f":"IF(BrewReport!L15>0,BrewReport!L15,\"\")","v":""},null,"Urtmængde i liter",25,"Anvendes til at beregne Effektivitet og Original Gravity"]
[{"$f":"IF(BrewReport!J16>0,BrewReport!J16,\"\")","v":30},{"$f":"IF(BrewReport!L16>0,BrewReport!L16,\"\")","v":72},null,"Flaskestørrelse i liter",0.5,"Anvendes til at beregne og vise antal genstande"]
[{"$f":"IF(BrewReport!J17>0,BrewReport!J17,\"\")","v":5},{"$f":"IF(BrewReport!L17>0,BrewReport!L17,\"\")","v":78},null,"Opvarmningstid af urt (min/°C)",1,"Anvendes til at beregne bryggetider"]
[{"$f":"IF(BrewReport!J18>0,BrewReport!J18,\"\")","v":""},{"$f":"IF(BrewReport!L18>0,BrewReport!L18,\"\")","v":""},null,"Beregninger","Malt","%","EBC","Ekstraktudbytte","OG"]
{"$rows_left_out":326}
{"sheet":"Omregninger","index":4,"n_rows":178,"n_cols":8,"rows_kept":178,"cut":false,"hidden":false,"merged":[[9,0,9,7],[1,0,1,7],[35,6,35,7],[33,1,33,4],[44,1,44,3],[11,1,11,2],[11,4,11,5],[34,1,34,4],[29,1,29,2],[28,1,28,2],[27,1,27,2],[26,1,26,2],[25,1,25,2],[24,1,24,2],[23,1,23,3]]}
[]
["Farver:"]
[]
[null,"Formål","Formel","Indtast","Beregn","Resultat"]
[null,"EBC to SRM:","SRM = EBC × 0,508","Indtast EBC",null,{"$f":"IF(E5=\"\",\"\",ROUND((E5*0.508),0))","v":""}]
[null,"SRM to EBC:","EBC = SRM × 1,97","Indtast SRM",null,{"$f":"IF(E6=\"\",\"\",ROUND((E6*1.97),0))","v":""}]
[null,"Lovibond to SRM:","SRM = (1,3546 × °L) - 0,76","Indtast °L",null,{"$f":"IF(E7=\"\",\"\",ROUND(((1.3546*E7)-0.76),0))","v":""}]
[null,"SRM to Lovibond:","°L = (SRM + 0,76) ÷ 1,3546","Indtast SRM",null,{"$f":"IF(E8=\"\",\"\",ROUND(((E8+0.76)/1.3546),0))","v":""}]
{"$rows_left_out":171}
{"sheet":"Malt","index":5,"n_rows":82,"n_cols":16,"rows_kept":82,"cut":false,"hidden":false,"merged":[[77,1,77,2]]}
["Malttyper","EBC Range","EBC Avg.","Ekstraktudbytte","Karakteristik","Malt i kg","Brygladen","Hjemmebryggeren","Albryg (10g interval)","Bryglageret","Brygforretningen",null,"Malt Pris\nGrupper","Priser\nkr./kg",null,"DropDown Menu"]
["Basis Malt",null,null,null,null,null,"G","H","I","J","K",null,null,15]
["Pilsner","2,5 - 4,0","3,25","300","Høj enzymaktivitet",{"$f":"IFERROR(VLOOKUP(Malt!$A3,BrewReport!$A$9:$D$18,4,FALSE),0)","v":0},{"$f":"F3*N5","v":0},{"$f":"F3*N7","v":0},{"$f":"F3*N7","v":0},{"$f":"F3*N7","v":0},{"$f":"F3*N5","v":0},null,null,16,null,{"$f":"IFERROR(INDEX($A$3:$A$75, SMALL(IF(ISBLANK(INDIRECT(CONCATENATE(\"$\",HLOOKUP(BrewReport!$F$7,$G$1:$K$2,2,FALSE),\"$3:$\",HLOOKUP(BrewReport!$F$7,$G$1:$K$2,2,FALSE),\"$80\"))), \"\", ROW(INDIRECT(CONCATENATE(\"$\",HLOOKUP(BrewReport!$F$7,$G$1:$K$2,2,FALSE),\"$3:$\",HLOOKUP(BrewReport!$F$7,$G$1:$K$2,2,FALSE),\"$80\")))-MIN(ROW(INDIRECT(CONCATENATE(\"$\",HLOOKUP(BrewReport!$F$7,$G$1:$K$2,2,FALSE),\"$3:$\",HLOOKUP(BrewReport!$F$7,$G$1:$K$2,2,FALSE),\"$80\"))))+1), ROW(A1))),\"\")","v":"Pilsner"}]
["Fuglsang Pilsner","3,7","3,7","320","Dansk, Høj enzymaktivitet",{"$f":"IFERROR(VLOOKUP(Malt!$A4,BrewReport!$A$9:$D$18,4,FALSE),0)","v":0},null,null,{"$f":"F4*N2","v":0},null,null,null,null,17,null,{"$f":"IFERROR(INDEX($A$3:$A$75, SMALL(IF(ISBLANK(INDIRECT(CONCATENATE(\"$\",HLOOKUP(BrewReport!$F$7,$G$1:$K$2,2,FALSE),\"$3:$\",HLOOKUP(BrewReport!$F$7,$G$1:$K$2,2,FALSE),\"$80\"))), \"\", ROW(INDIRECT(CONCATENATE(\"$\",HLOOKUP(BrewReport!$F$7,$G$1:$K$2,2,FALSE),\"$3:$\",HLOOKUP(BrewReport!$F$7,$G$1:$K$2,2,FALSE),\"$80\")))-MIN(ROW(INDIRECT(CONCATENATE(\"$\",HLOOKUP(BrewReport!$F$7,$G$1:$K$2,2,FALSE),\"$3:$\",HLOOKUP(BrewReport!$F$7,$G$1:$K$2,2,FALSE),\"$80\"))))+1), ROW(A2))),\"\")","v":"Vienna"}]
["Pilsner Bohemian","2,5 - 3,5",3,"300","Høj enzymaktivitet",{"$f":"IFERROR(VLOOKUP(Malt!$A5,BrewReport!$A$9:$D$18,4,FALSE),0)","v":0},{"$f":"F5*N5","v":0},null,{"$f":"F5*N3","v":0},{"$f":"F5*N7","v":0},null,null,"Grp 1 ",18,null,{"$f":"IFERROR(INDEX($A$3:$A$75, SMALL(IF(ISBLANK(INDIRECT(CONCATENATE(\"$\",HLOOKUP(BrewReport!$F$7,$G$1:$K$2,2,FALSE),\"$3:$\",HLOOKUP(BrewReport!$F$7,$G$1:$K$2,2,FALSE),\"$80\"))), \"\", ROW(INDIRECT(CONCATENATE(\"$\",HLOOKUP(BrewReport!$F$7,$G$1:$K$2,2,FALSE),\"$3:$\",HLOOKUP(BrewReport!$F$7,$G$1:$K$2,2,FALSE),\"$80\")))-MIN(ROW(INDIRECT(CONCATENATE(\"$\",HLOOKUP(BrewReport!$F$7,$G$1:$K$2,2,FALSE),\"$3:$\",HLOOKUP(BrewReport!$F$7,$G$1:$K$2,2,FALSE),\"$80\"))))+1), ROW(A3))),\"\")","v":"Pale Ale"}]
["Vienna","5 - 7","6","300","Farve, sødme og fylde",{"$f":"IFERROR(VLOOKUP(Malt!$A6,BrewReport!$A$9:$D$18,4,FALSE),0)","v":0},{"$f":"F6*N5","v":0},{"$f":"F6*N7","v":0},{"$f":"F6*N3","v":0},null,{"$f":"F6*N5","v":0},null,"Grp 2",19,null,{"$f":"IFERROR(INDEX($A$3:$A$75, SMALL(IF(ISBLANK(INDIRECT(CONCATENATE(\"$\",HLOOKUP(BrewReport!$F$7,$G$1:$K$2,2,FALSE),\"$3:$\",HLOOKUP(BrewReport!$F$7,$G$1:$K$2,2,FALSE),\"$80\"))), \"\", ROW(INDIRECT(CONCATENATE(\"$\",HLOOKUP(BrewReport!$F$7,$G$1:$K$2,2,FALSE),\"$3:$\",HLOOKUP(BrewReport!$F$7,$G$1:$K$2,2,FALSE),\"$80\")))-MIN(ROW(INDIRECT(CONCATENATE(\"$\",HLOOKUP(BrewReport!$F$7,$G$1:$K$2,2,FALSE),\"$3:$\",HLOOKUP(BrewReport!$F$7,$G$1:$K$2,2,FALSE),\"$80\"))))+1), ROW(A4))),\"\")","v":"Munich (Type 2)"}]
["Pale Ale","7,0 - 9,0",8,"300","Mørkere og mere maltet end Pilsner",{"$f":"IFERROR(VLOOKUP(Malt!$A7,BrewReport!$A$9:$D$18,4,FALSE),0)","v":3},{"$f":"F7*N7","v":60},{"$f":"F7*N7","v":60},{"$f":"F7*N3","v":48},{"$f":"F7*N6","v":57},{"$f":"F7*N5","v":54},null,"Grp 3",20,null,{"$f":"IFERROR(INDEX($A$3:$A$75, SMALL(IF(ISBLANK(INDIRECT(CONCATENATE(\"$\",HLOOKUP(BrewReport!$F$7,$G$1:$K$2,2,FALSE),\"$3:$\",HLOOKUP(BrewReport!$F$7,$G$1:$K$2,2,FALSE),\"$80\"))), \"\", ROW(INDIRECT(CONCATENATE(\"$\",HLOOKUP(BrewReport!$F$7,$G$1:$K$2,2,FALSE),\"$3:$\",HLOOKUP(BrewReport!$F$7,$G$1:$K$2,2,FALSE),\"$80\")))-MIN(ROW(INDIRECT(CONCATENATE(\"$\",HLOOKUP(BrewReport!$F$7,$G$1:$K$2,2,FALSE),\"$3:$\",HLOOKUP(BrewReport!$F$7,$G$1:$K$2,2,FALSE),\"$80\"))))+1), ROW(A5))),\"\")","v":"Munich Light (Type 1)"}]
["Munich (Type 2)","20 - 25","22,5","290","Sødme og fylde",{"$f":"IFERROR(VLOOKUP(Malt!$A8,BrewReport!$A$9:$D$18,4,FALSE),0)","v":0},{"$f":"F8*N5","v":0},{"$f":"F8*N7","v":0},{"$f":"F8*N7","v":0},{"$f":"F8*N16","v":0},{"$f":"F8*N5","v":0},null,"Grp 4",21,null,{"$f":"IFERROR(INDEX($A$3:$A$75, SMALL(IF(ISBLANK(INDIRECT(CONCATENATE(\"$\",HLOOKUP(BrewReport!$F$7,$G$1:$K$2,2,FALSE),\"$3:$\",HLOOKUP(BrewReport!$F$7,$G$1:$K$2,2,FALSE),\"$80\"))), \"\", ROW(INDIRECT(CONCATENATE(\"$\",HLOOKUP(BrewReport!$F$7,$G$1:$K$2,2,FALSE),\"$3:$\",HLOOKUP(BrewReport!$F$7,$G$1:$K$2,2,FALSE),\"$80\")))-MIN(ROW(INDIRECT(CONCATENATE(\"$\",HLOOKUP(BrewReport!$F$7,$G$1:$K$2,2,FALSE),\"$3:$\",HLOOKUP(BrewReport!$F$7,$G$1:$K$2,2,FALSE),\"$80\"))))+1), ROW(A6))),\"\")","v":"Maris Otter Ale"}]
{"$rows_left_out":75}
{"sheet":"Malt X-ref.","index":6,"n_rows":39,"n_cols":10,"rows_kept":39,"cut":false,"hidden":false,"merged":[[0,0,0,9]]}
[]
[null,"WEYERMANN","Castle Malting","MUNTONS","BRIESS","FAWCETT","BAIRDS","CRISP","GAMBRINUS","DINGEMANS"]
[null,"(German)","(Belgian)","(British)","(American)","(British)","(British)","(British)","(Canadian)","(Belgian)"]
[null,"Bohemian Pilsner","Pilsner","Lager","Pilsner","Lager",null,"Lager",null,"Pilsen"]
[null,"Pale","Pale Ale","Pale","Brewers 2-Row","Pale Ale","Pale Ale","Pale","Pale","Pale Ale"]
[null,null,"Maris Otter Ale","Maris Otter",null,"Maris Otter",null,null,"ESB"]
[null,"Vienna","Vienna","Mild","Vienna","Vienna","Vienna","Ashburne/Vienna"]
[null,"Abbey","Abbey"]
{"$rows_left_out":32}
{"sheet":"Humle","index":7,"n_rows":45,"n_cols":27,"rows_kept":45,"cut":false,"hidden":false,"merged":[[0,16,1,24],[0,13,1,15],[4,14,6,14],[4,15,6,15],[4,16,6,16],[4,17,6,17],[4,18,6,18],[4,19,6,19],[4,20,6,20],[4,21,6,21],[4,22,6,22],[4,23,6,23],[4,24,6,24],[41,0,41,3],[37,13,37,19],[3,14,3,24],[3,13,6,13],[35,13,35,19]]}
["Humletyper","Blomst / Pellet","Alfa Range %","IBU Avg.",null,"Beta Range %","Co-humulione %","Usage","Brewing usage","Used in","Aroma","Substitutes",null,"Glenn Tinseth's website",null,null,"Decimal Alpha Acid Utilization vs. Boil Time and Wort Original Gravity"]
[null,null,null,"Blomst","Pellet",null,null,"B/A",null,null,null,null,null,null,null,null,null,null,null,null,null,null,null,null,null,null,"Blomst/Pellet"]
["Admiral","P","13,0 - 16,0",null,14.2,"4,0 - 6,0","37 - 45","B","High alpha bittering hops. From Horticulture Research International,Wye College, Kent, England. It is a descendant of Northdown and Challenger","ESB, IPAs, Ales and Bitter","Discrete pine and fresh herbal character mixed with delicate citrus. "]
["Amarillo","P","8,0 - 11,0",null,8.8000000000000007,"6,0 - 7,0","21 - 24","BA","Unknown origin, but character similar to Cascade. Used for both bitterness and aroma","IPAs, Ales","Floral, tropical, and citrus (lemon, orange and grapefruit)","Cascade, Centennial, Simcoe",null,"Boil Time (min)","Original Gravity",null,null,null,null,null,null,null,null,null,null,null,"Blomst"]
["Bramling X","P","5,0 - 7,8",null,4,"2,3 - 3,5",34,"A","Developed in 1927 from commercial Goldings and wild hop variety.","ESB, Bitters, Pale Ale","Mild, fruity, currant aroma.","East Kent Goldings, Progress, Whitbred",null,null,1.03,1.04,1.05,1.06,1.07,1.08,1.0900000000000001,1.1000000000000001,1.1100000000000001,1.1200000000000001,1.1299999999999999,null,"Pellet"]
["Brewer's Gold","B","5,5 - 10,0",5.8,6.3,"3,5 - 4,5","37 - 40","B","Traditional bittering hop. An English variety and sibling of Bullion","English ales and heavy German lagers.","Spicy, fruity characteristics, black currant","Northern Brewer, Galena, Chinook, Eroica, Nugget"]
["Calypso","P","12,0 - 14,0",null,15.5,"5,0 - 6,0","40 - 42","BA","Calypso is a Yakima Valley bred, dual-purpose diploid hop with Hopsteiner lineage on both sides. It is marvelously complex with an almost understated earthy, tea-like note.","American ales and lagers","Despite its aroma-focused origins, it boasts a high alpha acid percentage. Calypso features crisp, fruity aromas and flavors that exhibit elements of apple, pear and stone fruit brightened with hints of lime citrus. ","Cascade, Belma"]
["Cascade","B / P","4,5 - 7,0",6.4,6.9,"4,5 - 7,0","33 - 40","BA","A hop with Northern Brewers Heritage","American ales and lagers","Strong spicy, floral, grapefruit character","Centennial",null,0,0,0,0,0,0,0,0,0,0,0,0]
{"$rows_left_out":38}
{"sheet":"Humle X-ref.","index":8,"n_rows":83,"n_cols":3,"rows_kept":83,"cut":false,"hidden":false,"merged":[]}
["HUMLE","Forslag fra 'hjemmebryg.things-4-you'","Forslag fra Humle arket (samlet fra forskellige sites)"]
["Admiral"," Rakau, Pilgrim",{"$f":"IFERROR(IF(VLOOKUP(A2,Humle!$A$4:$L$38,12,FALSE)=0,\"\",VLOOKUP(A2,Humle!$A$4:$L$38,12,FALSE)),\"\")","v":""}]
["Ahtanum"," Amarillo, Cascade, Centennial",{"$f":"IFERROR(IF(VLOOKUP(A3,Humle!$A$4:$L$38,12,FALSE)=0,\"\",VLOOKUP(A3,Humle!$A$4:$L$38,12,FALSE)),\"\")","v":""}]
["Amarillo"," Ahtanum, Cascade, Centennial",{"$f":"IFERROR(IF(VLOOKUP(A4,Humle!$A$4:$L$38,12,FALSE)=0,\"\",VLOOKUP(A4,Humle!$A$4:$L$38,12,FALSE)),\"\")","v":"Cascade, Centennial, Simcoe"}]
["Aramis"," Challenger, Ahtanum",{"$f":"IFERROR(IF(VLOOKUP(A5,Humle!$A$4:$L$38,12,FALSE)=0,\"\",VLOOKUP(A5,Humle!$A$4:$L$38,12,FALSE)),\"\")","v":""}]
["Boadicea"," Challenger, Sovereign, Golding",{"$f":"IFERROR(IF(VLOOKUP(A6,Humle!$A$4:$L$38,12,FALSE)=0,\"\",VLOOKUP(A6,Humle!$A$4:$L$38,12,FALSE)),\"\")","v":""}]
["Bobek"," Cascade",{"$f":"IFERROR(IF(VLOOKUP(A7,Humle!$A$4:$L$38,12,FALSE)=0,\"\",VLOOKUP(A7,Humle!$A$4:$L$38,12,FALSE)),\"\")","v":""}]
["Bouclier"," Tetnanger, Spalt Select, Tradition",{"$f":"IFERROR(IF(VLOOKUP(A8,Humle!$A$4:$L$38,12,FALSE)=0,\"\",VLOOKUP(A8,Humle!$A$4:$L$38,12,FALSE)),\"\")","v":""}]
{"$rows_left_out":76}
{"sheet":"Tilsætninger","index":9,"n_rows":24,"n_cols":5,"rows_kept":24,"cut":false,"hidden":false,"merged":[]}
["Tilsætninger","EBC","EBC Avg.","Udbytte"]
["Sukker",0,0,440]
["Rørsukker","20 - 30",25,420]
["Farin","50 - 75",65,420]
["Muscovado Sukker","80 - 120",100,400]
["Mørk Kandis","80 - 120",80,375]
["Lys Kandis",0,0,375]
["Dansk Honning",40,40,375]
{"$rows_left_out":17}
{"sheet":"Gær","index":10,"n_rows":69,"n_cols":10,"rows_kept":69,"cut":false,"hidden":false,"merged":[[66,2,66,5],[68,2,68,5]]}
["Gær Navn","Beskrivelse","Flocculation","Attenuation %","Attenuation Avg.","Temp. Range °C","Alc. Tolerance %",null,"Temp.(°C)","CO2"]
[null,null,null,null,null,null,null,null,0,1.71]
[" - Brewolution Abbey Ale","Den har en fantastisk og kraftig frugtaroma, balanceret perfekt med en mild og let krydret aroma, og komplekse og lækre krydrede phenoler.","Medium - High","73 - 77",75,"18 - 25",8,null,1,1.66]
["Brewolution American Ale","Denne gær giver en usædvanlig ren smag, ideel til at humlekarakteren kommer tydelig frem. Citrus og fyrresmag i humle vil blive fremhævet.","High","77 - 85",81,"18 - 23",10,null,2,1.61]
["Brewolution Belgian Strong Ale","Meget karakterfuld ølgær med krydrede, frugtige og pebrede noter.","Medium","85 - 90",90,"26 - 32",12,null,3,1.56]
["Brewolution British Ale","Gæren har en neutral gæraroma for at sikre, den fulde karakter af malt og humle er fremtrædende i hver øl.","Very High","77 - 82",80,"16 - 22",12,null,4,1.51]
["Brewolution Dark Ale","Fremmer krop og smag. Gæren giver en fyldig mørk frugt variation.","High","70 - 75",73,"18 - 22",8,null,5,1.46]
["Brewolution Universal Lager","Denne gær giver en blød, delikat og velafbalanceret øl, med en tør og ren smag.","High","72 - 76",77,"10 - 15",8,null,6,1.39]
{"$rows_left_out":62}
{"sheet":"Typer","index":11,"n_rows":125,"n_cols":23,"rows_kept":125,"cut":false,"hidden":false,"merged":[[1,0,1,1],[0,5,0,20],[0,0,0,2],[1,3,1,4]]}
["Ref.: Beer Judge Certification Program",null,null,null,null,"2015 BJCP Style Guidelines"]
["Style #",null,"Style Name","Style #",null,"OG high","OG low","FG high","FG low","ABV high","ABV low","EBC high","EBC low","IBU high","IBU low","RBR","CO2 High","CO2 Low","CO2 Avg.","Yeast Type","Brief",null,"Style #"]
[]
[1,"A","American Light Lager",1,"A","1040","1028","1008","0998","4,2","2,8",6,4,"12","8",0.34,2.73,2.57,{"$f":"IF(R4=\"\",\"\",(R4+Q4)/2)","v":2.65},"Lager",null,null,1]
[1,"B","American Lager",1,"B","1050","1040","1010","1004","5,3","4,2",8,4,"18","8",0.27,2.73,2.57,{"$f":"IF(R5=\"\",\"\",(R5+Q5)/2)","v":2.65},"Lager",null,null,1]
[1,"C","Cream Ale",1,"C","1055","1042","1012","1006","5,6","4,2",10,5,"20","8",0.38,2.7,2.6,2.6500000000000004,"Ale",null,null,1]
[1,"D","American Wheat Beer",1,"D","1055","1040","1013","1008","5,5","4,0",12,6,"30","15",0.48,2.6,2.2999999999999998,2.4500000000000002,"Ale",null,null,1]
[2,"A","International Pale Lager",2,"A","1050","1042","1012","1008","6,0","4,6",12,4,"25","18",0.74,2.5,2.2999999999999998,2.4,"Lager",null,null,2]
{"$rows_left_out":118}
{"sheet":"Indkøb","index":12,"n_rows":2,"n_cols":2,"rows_kept":2,"cut":false,"hidden":false,"merged":[[1,1,1,5]]}
[]
[null,"Her kan man f.eks. kopiere kvittering for indkøb ind."]

{"sheet":"Links","index":13,"n_rows":31,"n_cols":2,"rows_kept":31,"cut":false,"hidden":false,"merged":[]}
[]
["Shopping:","http://brygladen.com/"]
[null,"http://www.hjemmebryggeren.dk/"]
[null,"http://www.albryg.dk/"]
[null,"http://www.bryglageret.dk/"]
[null,"https://brygforretningen.dk/"]
[]
["Opskrifter:","http://www.candisyrup.com/recipes.html"]
{"$rows_left_out":23}