{"text_format":"1","workbook":"xlsx","n_sheets":16,"sheets":["BrewReport","INFO","Labels","Data","Omregninger","Malt","Malt Data","Malt X-ref.","Humle","Humle X-ref.","Tilsætninger","Gær","Typer","Indkøb","Fejlsøgning","Links"],"not_rendered":{"charts":1,"images":9,"macros":1,"external_links":0,"defined_names":7,"comments":7,"pivot_tables":0},"unopened":[],"bounds":{"document_bytes":16777216,"sheet_cells":100000,"rows_first":2000,"rows_last":500,"rows_between":2000,"halvings":0,"cell_chars":16384,"cell_head_chars":4096},"cells_cut":0,"cells_raw":0,"read":"whole","date_system":"1900"}

{"sheet":"BrewReport","index":0,"n_rows":86,"n_cols":15,"rows_kept":86,"cut":false,"hidden":false,"merged":[[64,8,64,9],[70,9,70,14],[64,13,64,14],[58,13,58,14],[27,11,27,12],[29,8,29,10],[22,8,22,10],[60,8,60,14],[64,11,64,12],[65,13,66,14],[66,8,66,10],[53,11,53,14],[65,8,65,10],[56,13,57,14],[66,11,66,12],[55,11,55,12],[65,11,65,12],[58,8,58,10],[56,11,56,12],[49,8,49,10],[62,11,62,14],[63,11,63,14],[58,11,58,12],[40,8,40,10],[2,6,2,9],[65,5,65,6],[64,5,64,6],[63,5,63,6],[62,5,62,6],[61,5,61,6],[23,5,23,6],[22,5,22,6],[25,5,25,6],[26,5,26,6],[27,5,27,6],[28,5,28,6],[29,5,29,6],[30,5,30,6],[31,5,31,6],[3,6,3,7],[39,5,39,6],[40,5,40,6],[41,5,41,6],[42,5,42,6],[43,5,43,6],[44,5,44,6],[57,5,57,6],[56,5,56,6],[37,5,37,6],[24,5,24,6],[32,5,32,6],[33,5,33,6],[34,5,34,6],[35,5,35,6],[36,5,36,6],[55,5,55,6],[54,5,54,6],[53,5,53,6],[52,5,52,6],[51,5,51,6],[50,5,50,6],[49,5,49,6],[48,5,48,6],[47,5,47,6],[6,5,6,6],[7,5,7,6],[18,5,18,6],[17,5,17,6],[16,5,16,6],[15,5,15,6],[14,5,14,6],[13,5,13,6],[12,5,12,6],[11,5,11,6],[10,5,10,6],[9,5,9,6],[8,5,8,6],[20,5,21,6],[74,11,74,12],[72,13,72,14],[83,4,83,7],[84,4,84,7],[85,1,85,7],[79,4,79,7],[79,1,79,3],[70,1,70,2],[84,1,84,3],[83,1,83,3],[82,1,82,3],[81,1,81,3],[80,1,80,3],[71,0,77,6],[81,4,81,7],[82,4,82,7],[70,3,70,6],[59,0,59,6],[60,2,60,6],[68,5,68,6],[67,5,67,6],[66,5,66,6],[57,8,57,10],[80,8,80,11],[80,12,80,14],[71,11,71,14],[67,8,67,10],[76,11,76,12],[76,8,76,10],[80,4,80,7],[77,13,77,14],[75,8,75,10],[73,8,73,10],[72,8,72,10],[69,8,69,14],[73,11,73,12],[71,8,71,10],[75,11,75,12],[72,11,72,12],[67,11,67,12],[67,13,67,14],[74,8,74,9],[1,0,1,2],[57,0,57,2],[55,0,55,2],[54,0,54,2],[56,0,56,2],[52,0,52,2],[50,0,50,2],[48,0,48,2],[53,0,53,2],[51,0,51,2],[49,0,49,2],[43,0,43,2],[42,0,42,2],[41,0,41,2],[40,0,40,2],[39,0,39,2],[6,0,6,3],[2,3,2,4],[44,0,44,2],[5,0,5,2],[3,0,3,2],[2,0,2,2],[46,0,46,6],[38,5,38,6],[2,12,2,14],[15,8,15,10],[23,11,23,12],[22,11,22,12],[32,11,32,12],[32,8,32,10],[44,8,44,10],[27,8,27,10],[28,8,28,10],[31,8,31,10],[37,11,37,12],[12,8,12,10],[11,8,11,10],[10,8,10,10],[8,8,8,10],[6,8,6,14],[16,8,16,10],[28,11,28,12],[3,11,3,12],[38,8,38,10],[40,11,40,12],[21,8,21,10],[7,12,7,13],[30,11,30,12],[5,11,5,12],[85,8,85,11],[85,12,85,14],[83,8,83,11],[83,12,83,14],[81,8,81,11],[81,12,81,14],[82,8,82,11],[82,12,82,14],[84,8,84,11],[84,12,84,14],[48,13,48,14],[48,11,48,12],[49,11,49,12],[73,13,73,14],[74,13,74,14],[75,13,76,14],[79,8,79,11],[79,12,79,14],[77,8,77,10],[77,11,77,12],[30,8,30,10],[57,11,57,12],[56,8,56,10],[0,0,0,2],[0,3,0,14],[56,3,56,4],[20,11,20,12],[21,11,21,12],[48,3,48,4],[42,11,42,12],[39,8,39,10],[39,11,39,12],[46,8,46,14],[38,11,38,12],[1,3,1,14],[7,8,7,10],[18,8,18,10],[9,8,9,10],[41,11,41,12],[25,11,25,12],[26,11,26,12],[54,11,54,14],[26,8,26,10],[36,8,36,10],[49,13,49,14],[55,13,55,14],[43,8,43,10],[14,8,14,10],[13,8,13,10],[24,11,24,12],[25,8,25,10],[51,8,51,14],[31,11,31,12],[42,8,42,10],[37,8,37,10],[47,8,47,12],[41,8,41,10],[44,11,44,12],[33,8,33,10],[33,11,33,12],[34,8,34,10],[34,11,34,12],[35,8,35,10],[35,11,35,12],[36,11,36,12],[43,11,43,12],[48,8,48,10],[29,11,29,12],[17,8,17,10],[20,8,20,10],[23,8,23,10],[24,8,24,10],[53,8,54,9],[62,8,63,9],[52,9,52,14],[61,9,61,14],[55,8,55,9]]}
["Bryggeri:",null,null,{"$f":"IF(Data!E2=\"\",\"\",Data!E2)","v":"Wolfhound Brewery"}]
["Bryg navn:"]
["Bryg nr.:",null,null,null,null,"Type:",null,null,null,null,{"$f":"IF($G$3=\"\",\"\",CONCATENATE(VLOOKUP($G$3,Typer!$C$4:$P$128,2,FALSE),VLOOKUP($G$3,Typer!$C$4:$P$128,3,FALSE)))","v":""},"Dato:"]
["Typiske data:",null,null,"EBC",{"$f":"IF($G$3=\"\",\"\",CONCATENATE(VLOOKUP($G$3,Typer!$C$4:$P$128,10,FALSE),\" - \",VLOOKUP($G$3,Typer!$C$4:$P$128,11,FALSE)))","v":""},"OG",{"$f":"IF($G$3=\"\",\"\",CONCATENATE(VLOOKUP($G$3,Typer!$C$3:$T$128,4,FALSE),\" - \",VLOOKUP($G$3,Typer!$C$3:$T$128,5,FALSE)))","v":""},null,"ABV %",{"$f":"IF($G$3=\"\",\"\",CONCATENATE(VLOOKUP($G$3,Typer!$C$3:$T$128,8,FALSE),\" - \",VLOOKUP($G$3,Typer!$C$3:$T$128,9,FALSE)))","v":""},"IBU",{"$f":"IFERROR(IF($G$3=\"\",\"\",CONCATENATE(VLOOKUP($G$3,Typer!$C$4:$P$128,12,FALSE),\" - \",VLOOKUP($G$3,Typer!$C$4:$P$128,13,FALSE))),\"\")","v":""},null,"RBR",{"$f":"IFERROR(IF($G$3=\"\",\"\",VLOOKUP($G$3,Typer!$C$4:$P$128,14,FALSE)),\"\")","v":""}]
[]
["Dette brygs data:",null,null,null,{"$f":"IF(Data!G26=0,\"\",Data!G26)","v":4},"OG",{"$f":"IF(D19=0,\"\",IF(D53=\"\",IF(M3=\"\",Data!I26,D51),IF(M3=\"\",Data!I26,D53)))","v":1002},null,"ABV %",{"$f":"IF(D58=\"\",IF(Data!I29=\"\",\"\",Data!I29),D58)","v":""},"IBU",{"$f":"IF(Data!I59=0,\"\",Data!I59)","v":""},null,"RBR",{"$f":"IF(AND(L54=\"\",L55=\"\"),\"\",IF(D55=\"\",IF(L6=\"\",\"\",(Data!I59/(G6-1000)*(1+((MAX(Data!G29:G30)/100)-0.7655)))),(Data!I59/(G6-1000)*(1+((D56/100)-0.7655)))))","v":""}]
{"$rows_left_out":81}
{"sheet":"INFO","index":1,"n_rows":24,"n_cols":10,"rows_kept":24,"cut":false,"hidden":false,"merged":[[17,2,19,2],[8,2,9,2],[23,0,23,5],[1,1,1,4],[3,2,6,2],[11,2,15,2],[1,6,1,9],[16,9,17,9],[16,7,17,7],[16,6,17,6],[19,7,20,7],[19,6,20,6],[19,9,20,9]]}
[]
[null,"Brew like a Monk - essentials",null,null,null,null,"Temperature steps in Beer Brewing"]
[null,null,null,null,null,null,"Temperature","Name","Function","Good for"]
[null,null,"Malts and Sugars","Limit malts darker than 100 EBC to 7%"]
[null,null,null,"Use sugar for 10 - 20% of grist",null,null,"35°C","Acid Rest","For undermodified malts;","Bohemian Pilsners"]
[null,null,null,"Sucrose adds alcohol and lightens the beer"]
{"$rows_left_out":19}
{"sheet":"Labels","index":2,"n_rows":92,"n_cols":22,"rows_kept":92,"cut":false,"hidden":false,"merged":[[91,15,91,21],[91,3,91,9],[68,15,68,21],[68,3,68,9],[45,15,45,21],[45,3,45,9],[22,15,22,21],[22,3,22,9],[79,22,89,23],[51,22,55,23],[54,16,54,17],[56,22,66,23],[71,1,73,11],[74,10,78,11],[77,4,77,5],[85,16,85,20],[51,3,52,9],[51,15,52,21],[56,4,56,8],[56,16,56,20],[56,10,66,11],[57,4,57,5],[57,16,57,17],[74,22,78,23],[71,13,73,23],[88,15,88,21],[74,3,75,9],[65,15,65,21],[62,4,62,8],[62,16,62,20],[74,15,75,21],[77,16,77,17],[85,4,85,8],[79,4,79,8],[79,16,79,20],[80,4,80,5],[80,16,80,17],[81,4,81,8],[81,16,81,20],[79,10,89,11],[88,3,88,9],[89,16,89,17],[89,4,89,5],[82,16,84,20],[82,4,84,8],[66,6,66,9],[66,18,66,21],[89,6,89,9],[89,18,89,21],[28,10,32,11],[25,1,27,11],[51,10,55,11],[42,3,42,9],[42,15,42,21],[65,3,65,9],[54,4,54,5],[47,4,47,9],[47,15,47,18],[48,1,50,11],[48,13,50,23],[34,4,34,5],[33,4,33,8],[33,16,33,20],[39,4,39,8],[39,16,39,20],[35,4,35,8],[58,4,58,8],[58,16,58,20],[43,16,43,17],[43,18,43,21],[66,4,66,5],[66,16,66,17],[10,10,20,11],[10,16,10,20],[16,16,16,20],[11,4,11,5],[11,16,11,17],[12,16,12,20],[12,4,12,8],[19,15,19,21],[20,4,20,5],[20,6,20,9],[0,1,0,23],[1,3,1,9],[5,3,6,9],[5,10,9,11],[5,15,6,21],[5,22,9,23],[8,4,8,5],[8,16,8,17],[2,13,4,23],[2,1,4,11],[33,22,43,23],[35,16,35,20],[59,16,61,20],[59,4,61,8],[13,16,15,20],[36,16,38,20],[36,4,38,8],[20,18,20,21],[20,16,20,17],[13,4,15,8],[33,10,43,11],[34,16,34,17],[19,3,19,9],[16,4,16,8],[28,3,29,9],[28,15,29,21],[25,13,27,23],[28,22,32,23],[31,16,31,17],[31,4,31,5],[43,4,43,5],[43,6,43,9],[10,22,20,23],[10,4,10,8]]}
[null,"FLASKE-ETIKETTER"]
[null,null,null,"Udfyldes automatisk fra BrewReport til denne Label "]
[]
[]
[]
[null,null,null,{"$f":"IF(BrewReport!D2<>\"\",CONCATENATE(BrewReport!D2,\" - \",BrewReport!G3),IF(BrewReport!G3=\"\",\"\",BrewReport!G3))","v":""},null,null,null,null,null,null,null,null,null,null,null,{"$f":"$D$6","v":""}]
{"$rows_left_out":87}
{"sheet":"Data","index":3,"n_rows":336,"n_cols":16,"rows_kept":336,"cut":false,"hidden":false,"merged":[[77,8,77,9],[60,4,60,8],[29,3,29,4],[34,10,35,10],[33,10,33,13],[34,13,35,13],[34,12,35,12],[34,11,35,11],[58,5,58,7],[31,3,31,4],[28,7,31,7],[53,3,55,3],[49,3,51,3],[41,3,43,3],[30,3,30,4],[45,3,47,3],[0,3,0,6],[33,15,35,15],[0,11,0,13],[34,7,34,8],[33,7,33,8],[1,4,1,8],[2,4,2,8],[5,5,5,8],[4,5,4,8],[3,5,3,8],[28,3,28,4],[27,6,27,7],[18,4,18,6],[23,11,23,13],[19,11,19,13],[24,11,24,13],[28,8,31,8],[31,11,31,13],[1,11,1,12],[5,11,5,12],[25,11,25,13],[4,11,4,12],[6,5,6,8],[6,11,6,12],[26,11,26,13],[30,11,30,13],[29,11,29,13],[28,11,28,13],[27,11,27,13],[3,11,3,12],[2,11,2,12],[16,3,21,3],[22,11,22,13],[21,11,21,13],[20,11,20,13],[18,11,18,13]]}
[{"$f":"IF(BrewReport!M10>0,BrewReport!M10,\"\")","v":""},{"$f":"IF(BrewReport!L10>0,BrewReport!L10,\"\")","v":""},null,"STAMDATA",null,null,null,"Version:",6.18,null,null,"Breweries"]
[{"$f":"IF(BrewReport!M12>0,BrewReport!M12,\"\")","v":""},{"$f":"IF(BrewReport!L12>0,BrewReport!L12,\"\")","v":""},null,"Bryggeri","Wolfhound Brewery",null,null,null,null,null,null,"eyeT Brewery",null,"André"]
[{"$f":"IF(BrewReport!M13>0,BrewReport!M13,\"\")","v":""},{"$f":"IF(BrewReport!L13>0,BrewReport!L13,\"\")","v":""},null,"Brygmester",{"$f":"IFERROR(VLOOKUP(E2,L2:N7,3,FALSE),\"\")","v":"Jesper Lyngbye"},null,null,null,null,null,null,"Liquid Temptations",null,"Stefan"]
[{"$f":"IF(BrewReport!M14>0,BrewReport!M14,\"\")","v":""},{"$f":"IF(BrewReport!L14>0,BrewReport!L14,\"\")","v":""},null,"Mæskeeffektivitet",0.7,"Anvendes til at estimere Original Gravity",null,null,null,null,null,"Liquid Temptations & EyeT Brewery",null,"Stefan & André"]
[{"$f":"IF(BrewReport!M15>0,BrewReport!M15,\"\")","v":""},{"$f":"IF(BrewReport!L15>0,BrewReport!L15,\"\")","v":""},null,"Urtmængde i liter",25,"Anvendes til at beregne Effektivitet og Original Gravity",null,null,null,null,null,"Wolfhound Brewery",null,"Jesper Lyngbye"]
[{"$f":"IF(BrewReport!M16>0,BrewReport!M16,\"\")","v":15},{"$f":"IF(BrewReport!L16>0,BrewReport!L16,\"\")","v":72},null,"Flaskestørrelse i liter",0.5,"Anvendes til at beregne og vise antal genstande",null,null,null,null,null,"Hulebækkensbryghus",null,"Pierre Lindberg"]
{"$rows_left_out":331}
{"sheet":"Omregninger","index":4,"n_rows":205,"n_cols":8,"rows_kept":205,"cut":false,"hidden":false,"merged":[[56,3,56,4],[9,0,9,7],[1,0,1,7],[62,6,62,7],[60,1,60,4],[71,1,71,3],[11,1,11,2],[11,4,11,5],[61,1,61,4],[56,1,56,2],[55,1,55,2],[54,1,54,2],[53,1,53,2],[52,1,52,2],[50,1,50,2],[49,1,49,3],[51,1,51,2]]}
[]
["Farver:"]
[]
[null,"Formål","Formel","Indtast","Beregn","Resultat"]
[null,"EBC to SRM:","SRM = EBC × 0,508","Indtast EBC",null,{"$f":"IF(E5=\"\",\"\",(ROUND((E5*0.508),0)&\" SRM\"))","v":""}]
[null,"SRM to EBC:","EBC = SRM × 1,97","Indtast SRM",null,{"$f":"IF(E6=\"\",\"\",(ROUND((E6*1.97),0)&\" EBC\"))","v":""}]
{"$rows_left_out":200}
{"sheet":"Malt","index":5,"n_rows":89,"n_cols":16,"rows_kept":89,"cut":false,"hidden":false,"merged":[[87,1,87,2]]}
["Malttyper","EBC Range","EBC Avg.","Ekstraktudbytte","Diastatisk Aktivitet\n(DP)\n\nDegree Lintner\n(°L)","Karakteristik","Malt i kg","Brygladen","Hjemmebryggeren","Albryg (10g interval)","Bryglageret","Brygforretningen",null,"Malt Pris\nGrupper","Priser\nkr./kg","DropDown Menu"]
["Basis Malt",null,null,null,null,null,null,"H","I","J","K","L",null,null,15]
["Pilsner","2,5 - 3,5","3","300","110","Høj enzymaktivitet",{"$f":"IFERROR(VLOOKUP(Malt!$A3,BrewReport!$A$9:$D$18,4,FALSE),0)","v":0},{"$f":"G3*O5","v":0},{"$f":"G3*O7","v":0},{"$f":"G3*O7","v":0},{"$f":"G3*O7","v":0},{"$f":"G3*O5","v":0},null,null,16,{"$f":"IFERROR(INDEX($A$3:$A$85, SMALL(IF(ISBLANK(INDIRECT(CONCATENATE(\"$\",HLOOKUP(BrewReport!$F$7,$H$1:$L$2,2,FALSE),\"$3:$\",HLOOKUP(BrewReport!$F$7,$H$1:$L$2,2,FALSE),\"$84\"))), \"\", ROW(INDIRECT(CONCATENATE(\"$\",HLOOKUP(BrewReport!$F$7,$H$1:$L$2,2,FALSE),\"$3:$\",HLOOKUP(BrewReport!$F$7,$H$1:$L$2,2,FALSE),\"$84\")))-MIN(ROW(INDIRECT(CONCATENATE(\"$\",HLOOKUP(BrewReport!$F$7,$H$1:$L$2,2,FALSE),\"$3:$\",HLOOKUP(BrewReport!$F$7,$H$1:$L$2,2,FALSE),\"$84\"))))+1), ROW(A1))),\"\")","v":"Pilsner"}]
["Fuglsang Pilsner","3,7","3,7","320","120","Dansk, Høj enzymaktivitet",{"$f":"IFERROR(VLOOKUP(Malt!$A4,BrewReport!$A$9:$D$18,4,FALSE),0)","v":0},null,null,{"$f":"G4*O2","v":0},null,null,null,null,17,{"$f":"IFERROR(INDEX($A$3:$A$85, SMALL(IF(ISBLANK(INDIRECT(CONCATENATE(\"$\",HLOOKUP(BrewReport!$F$7,$H$1:$L$2,2,FALSE),\"$3:$\",HLOOKUP(BrewReport!$F$7,$H$1:$L$2,2,FALSE),\"$84\"))), \"\", ROW(INDIRECT(CONCATENATE(\"$\",HLOOKUP(BrewReport!$F$7,$H$1:$L$2,2,FALSE),\"$3:$\",HLOOKUP(BrewReport!$F$7,$H$1:$L$2,2,FALSE),\"$84\")))-MIN(ROW(INDIRECT(CONCATENATE(\"$\",HLOOKUP(BrewReport!$F$7,$H$1:$L$2,2,FALSE),\"$3:$\",HLOOKUP(BrewReport!$F$7,$H$1:$L$2,2,FALSE),\"$84\"))))+1), ROW(A2))),\"\")","v":"Vienna"}]
["Pilsner Bohemian","2,5 - 3,5",3,"300","110","Høj enzymaktivitet",{"$f":"IFERROR(VLOOKUP(Malt!$A5,BrewReport!$A$9:$D$18,4,FALSE),0)","v":0},{"$f":"G5*O5","v":0},null,{"$f":"G5*O3","v":0},{"$f":"G5*O7","v":0},null,null,"Grp 1 ",18,{"$f":"IFERROR(INDEX($A$3:$A$85, SMALL(IF(ISBLANK(INDIRECT(CONCATENATE(\"$\",HLOOKUP(BrewReport!$F$7,$H$1:$L$2,2,FALSE),\"$3:$\",HLOOKUP(BrewReport!$F$7,$H$1:$L$2,2,FALSE),\"$84\"))), \"\", ROW(INDIRECT(CONCATENATE(\"$\",HLOOKUP(BrewReport!$F$7,$H$1:$L$2,2,FALSE),\"$3:$\",HLOOKUP(BrewReport!$F$7,$H$1:$L$2,2,FALSE),\"$84\")))-MIN(ROW(INDIRECT(CONCATENATE(\"$\",HLOOKUP(BrewReport!$F$7,$H$1:$L$2,2,FALSE),\"$3:$\",HLOOKUP(BrewReport!$F$7,$H$1:$L$2,2,FALSE),\"$84\"))))+1), ROW(A3))),\"\")","v":"Pale Ale"}]
["Vienna","5 - 7","6","300","50","Farve, sødme og fylde",{"$f":"IFERROR(VLOOKUP(Malt!$A6,BrewReport!$A$9:$D$18,4,FALSE),0)","v":0},{"$f":"G6*O5","v":0},{"$f":"G6*O7","v":0},{"$f":"G6*O3","v":0},null,{"$f":"G6*O5","v":0},null,"Grp 2",19,{"$f":"IFERROR(INDEX($A$3:$A$85, SMALL(IF(ISBLANK(INDIRECT(CONCATENATE(\"$\",HLOOKUP(BrewReport!$F$7,$H$1:$L$2,2,FALSE),\"$3:$\",HLOOKUP(BrewReport!$F$7,$H$1:$L$2,2,FALSE),\"$84\"))), \"\", ROW(INDIRECT(CONCATENATE(\"$\",HLOOKUP(BrewReport!$F$7,$H$1:$L$2,2,FALSE),\"$3:$\",HLOOKUP(BrewReport!$F$7,$H$1:$L$2,2,FALSE),\"$84\")))-MIN(ROW(INDIRECT(CONCATENATE(\"$\",HLOOKUP(BrewReport!$F$7,$H$1:$L$2,2,FALSE),\"$3:$\",HLOOKUP(BrewReport!$F$7,$H$1:$L$2,2,FALSE),\"$84\"))))+1), ROW(A4))),\"\")","v":"Munich"}]
{"$rows_left_out":84}
{"sheet":"Malt Data","index":6,"n_rows":99,"n_cols":8,"rows_kept":99,"cut":false,"hidden":false,"merged":[[0,0,0,1],[0,2,0,7]]}
["GRAINS CHART",null,"Here's a composite list of grains. The color is listed in degrees Lovibond and the gravity is calculated from 1 pound of the ingredient in 1 gallon of water."]
["American Grains","Malt","°Lovibond","EBC","Gravity","Yield","Ekstraktudbytte","Description"]
[null,"Black Barley","525 - 525°","1399 - 1399","1.023 - 1.027","49,7 - 58,4%",{"$f":"IFERROR(((ROUND(((((((MID(E3,4,2)+RIGHT(E3,2))/2)*3.785)/453)*1000)/10),0))*10),0)","v":210},"Imparts dryness. Unmalted; use in porters and dry stouts."]
[null,"Black Patent","500 - 500°","1334 - 1334","1.026 - 1.026","56,2 - 56,2%",220,"Provides color and sharp flavor in stouts and porters."]
[null,"Chocolate","350 - 350°","932 - 932","1.034 - 1.034","73,5 - 73,5%",280,"Use in all types to adjust color and add nutty, toasted flavor. Chocolate flavor."]
[null,"Crystal","10 - 10°","26 - 26","1.033 - 1.035","71,4 - 75,7%",280,"Sweet, mild caramel flavor and a golden color. Use in light lagers and light ales."]
{"$rows_left_out":94}
{"sheet":"Malt X-ref.","index":7,"n_rows":40,"n_cols":11,"rows_kept":40,"cut":false,"hidden":false,"merged":[[1,1,1,10]]}
[]
[null,"Malt X-reference - se Malt karakteristik nedenfor"]
[null,"WEYERMANN","Castle Malting","MUNTONS",null,"BRIESS","FAWCETT","BAIRDS","CRISP","GAMBRINUS","DINGEMANS"]
[null,"(German)","(Belgian)","(British)",null,"(American)","(British)","(British)","(British)","(Canadian)","(Belgian)"]
[null,"Bohemian Pilsner","Pilsner","Lager",null,"Pilsner","Lager",null,"Lager",null,"Pilsen"]
[null,"Pale","Pale Ale","Pale",null,"Brewers 2-Row","Pale Ale","Pale Ale","Pale","Pale","Pale Ale"]
{"$rows_left_out":35}
{"sheet":"Humle","index":8,"n_rows":80,"n_cols":26,"rows_kept":80,"cut":false,"hidden":false,"merged":[[34,14,34,23],[34,24,34,34],[3,15,3,25],[32,14,32,20],[0,8,1,8],[0,17,1,25],[0,14,1,16],[3,14,4,14],[32,21,32,28]]}
["Humletyper","Alfa Range %","IBU Avg.",null,"Beta Range %","Co-humulione %","Usage","Min. orders","Pris i kr. \npr. gram","Description","Used in","Characteristics","Substitutes",null,"Glenn Tinseth's website",null,null,"Decimal Alpha Acid Utilization vs. Boil Time and Wort Original Gravity"]
[null,null,"Pellet","Blomst",null,null,"B/A","1 or 100 grams"]
["Admiral","13,0 - 16,0",14.6,null,"4,0 - 6,0","37 - 45","B",100,0.4,"High alpha bittering hops. From Horticulture Research International,Wye College, Kent, England. It is a descendant of Northdown and Challenger","ESB, IPAs, Ales and Bitter","Discrete pine and fresh herbal character mixed with delicate citrus. ",{"$f":"VLOOKUP(A3,'Humle X-ref.'!$A$2:$D$141,4,FALSE)","v":"Target, Challenger"}]
["Ahtanum","3,5 - 6,5",null,null,"4,0 - 6,0","30 - 34","A",null,null,"This hop is used for its aromatic properties and moderate bittering. It has aromas that are citrus (grapefruit), earthy, and floral. ","American Style ales","Specific aroma descriptors include citrus grapefruit and geranium.",{"$f":"VLOOKUP(A4,'Humle X-ref.'!$A$2:$D$141,4,FALSE)","v":"Cascade, Amarillo"},null,"Boil Time (min)","Original Gravity"]
["Amarillo","8,0 - 11,0",9.1,null,"6,0 - 7,0","21 - 24","BA",1,0.6,"Unknown origin, but character similar to Cascade. Used for both bitterness and aroma","IPAs, Ales","Floral, tropical, and citrus (lemon, orange and grapefruit)",{"$f":"VLOOKUP(A5,'Humle X-ref.'!$A$2:$D$141,4,FALSE)","v":"Cascade, Centennial, Citra, Simcoe"},null,null,1.03,1.04,1.05,1.06,1.07,1.08,1.0900000000000001,1.1000000000000001,1.1100000000000001,1.1200000000000001,1.1299999999999999]
["Azacca","14 - 16",null,null,"4,0 - 5,5","38 - 45","BA",null,null,"Descended directly from Toyomidori, its greater parentage also includes Summit™ and Northern Brewer. Azacca is considered by many brewers as being well suited to IPAs.","American IPAs","Aromas of tropical fruits and citrus. Tasting notes of spicy mango, pineapple, tangerine and pine.",{"$f":"VLOOKUP(A6,'Humle X-ref.'!$A$2:$D$141,4,FALSE)","v":"Centennial"},null,0,0,0,0,0,0,0,0,0,0,0,0]
{"$rows_left_out":75}
{"sheet":"Humle X-ref.","index":9,"n_rows":449,"n_cols":4,"rows_kept":449,"cut":false,"hidden":false,"merged":[]}
["Navn","Land","Karakteristika","Erstatning"]
["Admiral","GB","Avlet som erstatning for Target, men med en mindre barsk bitterhed. Svag aroma med en mild citrus karakter.","Target, Challenger"]
["Ahtanum","US","Citrus og blomsteragtig karakter, med grapefrugt kvaliteter, der siges at være stærkere end i Cascade.","Cascade, Amarillo"]
["Amarillo","US","Blomsteragtig, grapefrugt, citrus, fersken","Cascade, Centennial, Citra, Simcoe"]
["Apollo","US","Appelsinagtig med lidt harpiks. Ret potent.","Columbus, Tomahawk, Magnum"]
["Aramis","US","Krydret, blomster, nyopgravet muldjord, citron","Centennial, Chinook, Hallertau, Tettnanger"]
{"$rows_left_out":444}
{"sheet":"Tilsætninger","index":10,"n_rows":40,"n_cols":14,"rows_kept":40,"cut":false,"hidden":false,"merged":[]}
["Tilsætninger","EBC","EBC Avg.","Udbytte",null,null,"Sugars","Malt","°Lovibond","EBC","Gravity","Yield","Ekstraktudbytte","Description"]
["Farin","50 - 75",65,420,null,null,null,"Belgian Candi Sugar (clear)","0.5-0.5°","1 - 1","1.036-1.036","77,9 - 77,9%",{"$f":"IFERROR(((ROUND(((((((MID(K2,4,2)+RIGHT(K2,2))/2)*3.785)/453)*1000)/10),0))*10),0)","v":300},"Smooth taste, good head retention, sweet aroma and high gravity without being apparent. Use in Belgian and holiday ales. Use clear for tripels."]
["Lyle's Golden Syrup",30,30,375,"Estimat",null,null,"Brown Sugar","40-40°","104 - 104","1.046-1.046","99,5 - 99,5%",{"$f":"IFERROR(((ROUND(((((((MID(K3,4,2)+RIGHT(K3,2))/2)*3.785)/453)*1000)/10),0))*10),0)","v":380},"Imparts rich, sweet flavor. Use in Scottish ales, old ales and holiday beers."]
["Lyle's Black Treacle",200,200,375,"Estimat",null,null,"Candi Sugar (amber)","75-75°","199 - 199","1.036-1.036","77,9 - 77,9%",300,"Smooth taste, good head retention, sweet aroma and high gravity without being apparent. Use in Belgian and holiday ales. Use amber for dubbels."]
["Lys Kandis",0,0,375,null,null,null,"Candi Sugar (dark)","275-275°","733 - 733","1.036-1.036","77,9 - 77,9%",300,"Smooth taste, good head retention, sweet aroma and high gravity without being apparent. Use in Belgian and holiday ales. Use dark in brown beer and strong golden ales."]
["Mørk Kandis","80 - 120",80,375,null,null,null,"Corn Sugar","1-1°","2 - 2","1.037-1.037","80 - 80%",310,"Use in priming beer or in extract recipes where flaked maize would be used in a mash."]
{"$rows_left_out":35}
{"sheet":"Gær","index":11,"n_rows":75,"n_cols":10,"rows_kept":75,"cut":false,"hidden":false,"merged":[[72,2,72,5],[74,2,74,5]]}
["Gær Navn","Beskrivelse","Flocculation","Attenuation %","Attenuation Avg.","Temp. Range °C","Alc. Tolerance %",null,"Temp.(°C)","CO2"]
[null,null,null,null,null,null,null,null,0,1.71]
["Brewolution Abbey Ale","Den har en fantastisk og kraftig frugtaroma, balanceret perfekt med en mild og let krydret aroma, og komplekse og lækre krydrede phenoler.","Medium - High","73 - 77",75,"18 - 25",8,null,1,1.66]
["Brewolution American Ale","Denne gær giver en usædvanlig ren smag, ideel til at humlekarakteren kommer tydelig frem. Citrus og fyrresmag i humle vil blive fremhævet.","High","77 - 85",81,"18 - 23",10,null,2,1.61]
["Brewolution Belgian Strong Ale","Meget karakterfuld ølgær med krydrede, frugtige og pebrede noter.","Medium","85 - 90",85,"26 - 32",12,null,3,1.56]
["Brewolution British Ale","Gæren har en neutral gæraroma for at sikre, den fulde karakter af malt og humle er fremtrædende i hver øl.","Very High","77 - 82",80,"16 - 22",12,null,4,1.51]
{"$rows_left_out":70}
{"sheet":"Typer","index":12,"n_rows":128,"n_cols":21,"rows_kept":128,"cut":false,"hidden":false,"merged":[[1,0,1,1],[0,5,0,20],[0,0,0,2],[1,3,1,4],[116,20,118,20]]}
["Ref.: Beer Judge Certification Program",null,null,null,null,"OBS: 27J and 27K are not part of BJCP 2015 styles"]
["Style #",null,"Style Name","Style #",null,"OG high","OG low","FG high","FG low","ABV high","ABV low","EBC high","EBC low","IBU high","IBU low","RBR","CO2 High","CO2 Low","CO2 Avg.","Yeast Type","Examples"]
[]
[1,"A","American Light Lager",1,"A","1040","1028","1008","0998","4,2","2,8",6,4,"12","8",0.34,2.73,2.57,{"$f":"IF(R4=\"\",\"\",(R4+Q4)/2)","v":2.65},"Lager","Bud Light, Coors Light, Keystone Light, Michelob Light, Miller Lite, Old Milwaukee Light"]
[1,"B","American Lager",1,"B","1050","1040","1010","1004","5,3","4,2",8,4,"18","8",0.27,2.73,2.57,{"$f":"IF(R5=\"\",\"\",(R5+Q5)/2)","v":2.65},"Lager","Budweiser, Coors Original, Grain Belt Premium Lager, Miller High Life, Pabst Blue Ribbon, Special Export"]
[1,"C","Cream Ale",1,"C","1055","1042","1012","1006","5,6","4,2",10,5,"20","8",0.38,2.7,2.6,2.6500000000000004,"Ale","Genesee Cream Ale, Liebotschaner Cream Ale, Little Kings Cream Ale, New Glarus Spotted Cow, Old Style, Sleeman Cream Ale"]
{"$rows_left_out":123}
{"sheet":"Indkøb","index":13,"n_rows":45,"n_cols":8,"rows_kept":45,"cut":false,"hidden":false,"merged":[[1,0,1,9],[2,1,2,7]]}
[]
["Her kopieres varer til indkøb - filtrér tomme felter væk for at samle listen"]
[null,"Indsæt evt. selv bemærkninger og faktiske enhedspriser, \nellers regnes med priser på malt- og humlesiderne."]
[]
[null,"Vare",null,"Vægt","Enhed","à pris","Pris","Bemærkning"]
[null,{"$f":"IF(BrewReport!A9=\"\",\"\",BrewReport!A9)","v":""},null,{"$f":"IF(BrewReport!D9=\"\",\"\",BrewReport!D9*1000)","v":""},{"$f":"IF(D6=\"\",\"\",\"g\")","v":""},null,{"$f":"IF(F6=\"\",IFERROR(VLOOKUP($B6,Malt!$A$3:$L$85,COLUMN(INDIRECT(CONCATENATE(HLOOKUP(BrewReport!$F$7,Malt!$H$1:$L$2,2,FALSE),2))),FALSE),\"\"),F6*D6)","v":""}]
{"$rows_left_out":40}
{"sheet":"Fejlsøgning","index":14,"n_rows":104,"n_cols":2,"rows_kept":104,"cut":false,"hidden":false,"merged":[[11,0,16,0],[5,0,10,0],[39,0,41,0],[37,0,38,0],[35,0,36,0],[31,0,34,0],[26,0,30,0],[22,0,25,0],[61,0,65,0],[58,0,60,0],[53,0,57,0],[46,0,52,0],[17,0,21,0],[0,0,0,1],[2,0,2,1],[103,0,104,0],[101,0,102,0],[98,0,100,0],[95,0,97,0],[93,0,94,0],[91,0,92,0],[42,0,45,0],[87,0,90,0],[84,0,86,0],[82,0,83,0],[79,0,81,0],[75,0,78,0],[69,0,74,0],[66,0,68,0]]}
["Troubleshooting Chart"]
[]
["Key:    “X”: For beers made with malt extract,      “AG”: For all-grain beers"]
[]
["Problem","Causes"]
["Fermentation does not start","Inadequate amount of yeast pitched"]
{"$rows_left_out":99}
{"sheet":"Links","index":15,"n_rows":40,"n_cols":2,"rows_kept":40,"cut":false,"hidden":false,"merged":[]}
[]
["Shopping:","http://www.hjemmebryggeren.dk/"]
[null,"http://brygladen.com/"]
[null,"http://www.albryg.dk/"]
[null,"http://www.bryglageret.dk/"]
[null,"https://brygforretningen.dk/"]
{"$rows_left_out":34}